{"text_format":"1","workbook":"xlsx","n_sheets":3,"sheets":["Formular","Daten","Stammdaten"],"not_rendered":{"charts":0,"images":9,"macros":1,"external_links":0,"defined_names":26,"comments":2,"pivot_tables":0},"unopened":[],"bounds":{"document_bytes":16777216,"sheet_cells":100000,"rows_first":2000,"rows_last":500,"rows_between":2000,"halvings":0,"cell_chars":16384,"cell_head_chars":4096},"cells_cut":0,"cells_raw":0,"read":"whole","date_system":"1900"}

{"sheet":"Formular","index":0,"n_rows":40,"n_cols":18,"rows_kept":40,"cut":false,"hidden":false,"merged":[[31,17,38,17],[39,17,40,17],[22,17,30,17],[16,21,17,21],[22,21,27,21],[12,17,14,17],[15,17,21,17],[9,6,9,13],[33,14,33,15],[34,14,34,15],[35,14,35,15],[36,14,36,15],[37,14,37,15],[38,14,38,15],[39,14,39,15],[40,14,40,15],[19,8,19,15],[18,3,18,15],[12,5,12,6],[21,14,21,15],[22,14,22,15],[23,14,23,15],[39,12,39,13],[40,12,40,13],[96,14,96,15],[97,14,97,15],[98,14,98,15],[99,14,99,15],[100,14,100,15],[101,14,101,15],[9,2,9,3],[87,14,87,15],[88,14,88,15],[89,14,89,15],[90,14,90,15],[91,14,91,15],[92,14,92,15],[93,14,93,15],[94,14,94,15],[95,14,95,15],[78,14,78,15],[79,14,79,15],[80,14,80,15],[81,14,81,15],[82,14,82,15],[83,14,83,15],[84,14,84,15],[85,14,85,15],[86,14,86,15],[69,14,69,15],[70,14,70,15],[71,14,71,15],[72,14,72,15],[73,14,73,15],[74,14,74,15],[75,14,75,15],[76,14,76,15],[77,14,77,15],[60,14,60,15],[61,14,61,15],[62,14,62,15],[63,14,63,15],[64,14,64,15],[65,14,65,15],[66,14,66,15],[67,14,67,15],[68,14,68,15],[51,14,51,15],[52,14,52,15],[53,14,53,15],[54,14,54,15],[55,14,55,15],[56,14,56,15],[57,14,57,15],[58,14,58,15],[59,14,59,15],[42,14,42,15],[43,14,43,15],[44,14,44,15],[45,14,45,15],[46,14,46,15],[47,14,47,15],[48,14,48,15],[49,14,49,15],[50,14,50,15],[22,0,22,1],[22,12,22,13],[23,0,23,1],[23,12,23,13],[21,12,21,13],[22,2,22,10],[23,2,23,10],[41,14,41,15],[24,14,24,15],[25,14,25,15],[26,14,26,15],[27,14,27,15],[28,14,28,15],[29,14,29,15],[30,14,30,15],[31,14,31,15],[32,14,32,15],[39,2,39,10],[37,12,37,13],[38,0,38,1],[38,12,38,13],[35,12,35,13],[36,0,36,1],[36,12,36,13],[47,12,47,13],[18,0,18,1],[45,0,45,1],[45,12,45,13],[46,0,46,1],[46,12,46,13],[43,0,43,1],[43,12,43,13],[44,0,44,1],[44,12,44,13],[41,0,41,1],[41,12,41,13],[42,0,42,1],[42,12,42,13],[47,0,47,1],[39,0,39,1],[35,0,35,1],[31,0,31,1],[24,0,24,1],[26,0,26,1],[40,0,40,1],[37,0,37,1],[33,0,33,1],[36,2,36,10],[37,2,37,10],[38,2,38,10],[33,12,33,13],[34,0,34,1],[34,12,34,13],[31,12,31,13],[32,0,32,1],[32,12,32,13],[33,2,33,10],[34,2,34,10],[35,2,35,10],[26,12,26,13],[27,0,27,1],[27,12,27,13],[28,0,28,1],[28,12,28,13],[25,0,25,1],[25,12,25,13],[29,12,29,13],[30,0,30,1],[30,12,30,13],[29,0,29,1],[0,0,0,15],[11,10,11,12],[2,1,2,5],[3,1,3,5],[4,1,4,5],[6,9,6,12],[11,5,11,6],[3,6,3,7],[24,12,24,13],[5,2,5,5],[6,2,6,5],[2,0,4,0],[4,6,4,7],[21,0,21,1],[21,2,21,7],[21,8,21,10],[10,2,10,4],[11,7,11,9],[11,3,11,4],[12,1,12,4],[15,5,15,12],[16,5,16,12],[14,4,14,12],[19,3,19,6],[48,12,48,13],[49,12,49,13],[50,12,50,13],[51,0,51,1],[51,12,51,13],[52,0,52,1],[52,12,52,13],[49,2,49,10],[50,2,50,10],[51,2,51,10],[52,2,52,10],[48,0,48,1],[49,0,49,1],[50,0,50,1],[53,12,53,13],[54,0,54,1],[54,12,54,13],[55,0,55,1],[55,12,55,13],[56,0,56,1],[56,12,56,13],[53,2,53,10],[54,2,54,10],[55,2,55,10],[56,2,56,10],[53,0,53,1],[57,0,57,1],[57,12,57,13],[58,0,58,1],[58,12,58,13],[59,0,59,1],[59,12,59,13],[57,2,57,10],[58,2,58,10],[59,2,59,10],[60,0,60,1],[60,12,60,13],[61,0,61,1],[61,12,61,13],[62,0,62,1],[62,12,62,13],[60,2,60,10],[61,2,61,10],[62,2,62,10],[63,0,63,1],[63,12,63,13],[64,0,64,1],[64,12,64,13],[65,0,65,1],[65,12,65,13],[63,2,63,10],[64,2,64,10],[65,2,65,10],[66,0,66,1],[66,12,66,13],[67,0,67,1],[67,12,67,13],[68,0,68,1],[68,12,68,13],[66,2,66,10],[67,2,67,10],[68,2,68,10],[69,0,69,1],[69,12,69,13],[70,0,70,1],[70,12,70,13],[71,0,71,1],[71,12,71,13],[69,2,69,10],[70,2,70,10],[71,2,71,10],[72,0,72,1],[72,12,72,13],[73,0,73,1],[73,12,73,13],[74,0,74,1],[74,12,74,13],[72,2,72,10],[73,2,73,10],[74,2,74,10],[75,0,75,1],[75,12,75,13],[76,0,76,1],[76,12,76,13],[77,0,77,1],[77,12,77,13],[75,2,75,10],[76,2,76,10],[77,2,77,10],[78,0,78,1],[78,12,78,13],[79,0,79,1],[79,12,79,13],[80,0,80,1],[80,12,80,13],[78,2,78,10],[79,2,79,10],[80,2,80,10],[81,0,81,1],[81,12,81,13],[82,0,82,1],[82,12,82,13],[83,0,83,1],[83,12,83,13],[81,2,81,10],[82,2,82,10],[83,2,83,10],[84,0,84,1],[84,12,84,13],[85,0,85,1],[85,12,85,13],[86,0,86,1],[86,12,86,13],[84,2,84,10],[85,2,85,10],[86,2,86,10],[92,12,92,13],[90,2,90,10],[91,2,91,10],[92,2,92,10],[87,0,87,1],[87,12,87,13],[88,0,88,1],[88,12,88,13],[89,0,89,1],[89,12,89,13],[87,2,87,10],[88,2,88,10],[89,2,89,10],[7,2,7,15],[99,0,99,1],[99,12,99,13],[100,0,100,1],[100,12,100,13],[101,0,101,1],[101,12,101,13],[93,0,93,1],[93,12,93,13],[94,0,94,1],[94,12,94,13],[95,0,95,1],[95,12,95,13],[96,0,96,1],[96,12,96,13],[97,0,97,1],[97,12,97,13],[98,0,98,1],[98,12,98,13],[90,0,90,1],[90,12,90,13],[91,0,91,1],[91,12,91,13],[92,0,92,1],[24,2,24,10],[25,2,25,10],[26,2,26,10],[27,2,27,10],[28,2,28,10],[29,2,29,10],[30,2,30,10],[31,2,31,10],[32,2,32,10],[40,2,40,10],[41,2,41,10],[42,2,42,10],[43,2,43,10],[44,2,44,10],[45,2,45,10],[46,2,46,10],[47,2,47,10],[48,2,48,10],[93,2,93,10],[94,2,94,10],[95,2,95,10],[96,2,96,10],[97,2,97,10],[98,2,98,10],[99,2,99,10],[100,2,100,10],[101,2,101,10]]}
["Hessischer Kegler- u. Bowling-Verband e.V.  Sektion Bowling",null,null,null,null,null,null,null,null,null,null,null,null,null,null,null,null,"Die grauen Felder links sind auszufüllen"]
["Meldebogen HM 2021 - 2022",null,null,null,null,null,null,null,"Seniorinnen, Senioren Trio"]
["Leitung:",{"$f":"VLOOKUP(I2,event,3,FALSE)","v":"Luci Wolf"},null,null,null,null,"Datum",null,"Ort",null,null,"Startzeiten:",null,null,null,null,null,"Achtung: "]
[null,{"$f":"VLOOKUP(I2,event,5,FALSE)","v":"Eugen-Roth-Straße 9"},null,null,null,null,{"$f":"VLOOKUP(I2,event,15,FALSE)","v":"2022-01-15"},null,{"$f":"VLOOKUP(I2,event,13,FALSE)","v":"Wiesbaden"},null,null,{"$f":"IF(ISERROR(VLOOKUP(I2,event,17,FALSE)),\"\",VLOOKUP(I2,event,17,FALSE))","v":"09:00:00"},{"$f":"IF(ISERROR(VLOOKUP(I2,event,18,FALSE)),\"\",VLOOKUP(I2,event,18,FALSE))","v":"13:30:00"},{"$f":"IF(ISERROR(VLOOKUP(I2,event,19,FALSE)),\"\",VLOOKUP(I2,event,19,FALSE))","v":" "},{"$f":"IF(ISERROR(VLOOKUP(J2,event,19,FALSE)),\"\",VLOOKUP(J2,event,19,FALSE))","v":""},{"$f":"IF(ISERROR(VLOOKUP(K2,event,19,FALSE)),\"\",VLOOKUP(K2,event,19,FALSE))","v":""},null,"Die Junioren spielen zusammen mit den Aktiven (Damen/Herren) mit gemeinsamer Wertung)."]
[null,{"$f":"VLOOKUP(I2,event,4,FALSE)","v":"63110 Rodgau"},null,null,null,null,{"$f":"VLOOKUP(I2,event,16,FALSE)","v":"2022-01-16"},null,{"$f":"VLOOKUP(I2,event,14,FALSE)","v":"Eschersheim"},null,null,"Aus Ausschreibung entnehmen",null,null,null,null,null,"In die Betreffzeile der E-Mail ist als erstes die Clubnummer und der Clubname einzutragen "]
[null,"Tel",{"$f":"VLOOKUP(I2,event,6,FALSE)","v":"0177 / 3947622"},null,null,null,"Startplätze pro Start",null,null,{"$f":"VLOOKUP(I2,event,12,FALSE)","v":22}]
[null,"Fax",{"$f":"VLOOKUP(I2,event,7,FALSE)","v":0},null,null,null,"Meldeschluss:",null,null,{"$f":"VLOOKUP(I2,event,9,FALSE)","v":"2022-01-07"},null,null,null,null,null,null,null,"Vorgehensweise"]
[null,"E-Mail",{"$f":"VLOOKUP(I2,event,8,FALSE)","v":"\nsektionsseniorenwart-bowling@hkbv-ev.de"}]
["(bitte den vollständig ausgefüllten Meldebogen als xls an die Leitung senden - Adresse obenstehend)",null,null,null,null,null,null,null,null,null,null,null,null,null,null,null,null,"Jeweils mit Pfeiltaste       auswählen"]
["Verein / Club:",null,8031,null,null,null,"BC Blau-Gelb Frankfurt",null,null,null,null,null,null,null,null,null,null,"1. Wettbewerb"]
[null,null,null,null,null,null,null,null,null,null,null,null,null,null,null,null,null,"2. Verein"]
["Wir melden:",null,1,"Starts á ",null,{"$f":"VLOOKUP(I2,event,10,FALSE)","v":54},null,"Gesamtbetrag von ",null,null,{"$f":"F12*C12","v":54},null,null,null,null,null,null,"3. Anzahl der Meldungen eintragen"]
[null,"Bei Zahlung vor Ort",null,null,null,{"$f":"VLOOKUP(I2,event,11,FALSE)","v":60},null,null,null,null,null,null,null,null,null,null,null,"4. Name und Kontaktdaten des Meldenden\n    eintragen"]
[]
["Bitte den Gesamtbetrag an die",null,null,null,{"$f":"VLOOKUP(I2,event,29,FALSE)","v":"HKBV e.V. - Sektion Bowling   Sparkasse Dieburg"}]
[null,null,null,null,"IBAN: ",{"$f":"VLOOKUP(I2,event,27,FALSE)","v":"DE 28 5085 2651 0136 0071 84"},null,null,null,null,null,null,null,null,null,null,null,"5. Spielerdaten auswählen, entweder über Pfeil  \n    'EDV Nr suchen' oder 'Namen suchen'\n\n    Mit dem Kontrollkasten \"Nur Club anzeigen\" \n    werden zur Auswahl alle Spieler oder nur \n    die des jeweiligen Clubs angeboten.\n\n    Auswahl unbedingt mit Enter bestätigen, dann \n    werden die Spielerdaten unten nach \n    dem jeweils letzen Datensatz eingefügt\n"]
[null,null,null,null,"BIC:    ",{"$f":"VLOOKUP(I2,event,28,FALSE)","v":"HELADEF1DIE"}]
["überweisen und die Kopie  des Überweisungsbelegs der Anmeldung beilegen."]
["Gemeldet von:"]
["Kontktdaten:",null,"Tel.:",null,null,null,null,"e Mail:"]
["EDV Nr suchen",null,null,null,null,"Namen suchen"]
["EDV Nr",null,"Name/Vorname",null,null,null,null,null,null,null,null,"RL","AK",null,"Startzeit"]
[null,null,null,null,null,null,null,null,null,null,null,null,null,null,null,null,null,"Die Spielerdaten können auch manuell in die \nZeilen 23 ff eingegeben werden\nBei Eingabe einer EDV-Nr in Spalte 1 ab Zeile 23 \nund drücken der Taste Enter werden die dazu gehörigen Spielerdaten eingesetzt.\n\nDies ist unbedingt erforderlich, wenn nach Eingabe der EDV Nr keine Daten angezeigt werden. \n\nWenn Spieler noch nicht bekannt\nEDV-Nr. = 0 und Name = unbekannt\neingeben"]
[]
[]
[]
[]
[]
[]
[]
[]
[null,null,null,null,null,null,null,null,null,null,null,null,null,null,null,null,null,"Wenn die Eingaben für einen Wettbewerb beendet \nsind, bitte den Button 'Für Versand vorbereiten' anklicken. (oben rechts)\nDiese Datei speichern und per Mail an die entsprechende Kontaktperson weiterleiten.\n\noder: \nDen Button 'PDF erzeugen' (oben rechts) betätigen und Meldung weiterleiten. Das Pdf-Dokument wird im gleichen Ordner gespeichert, in dem der Meldebogen abgelegt ist."]
[]
[]
[]
[]
[]
[]
[]
[null,null,null,null,null,null,null,null,null,null,null,null,null,null,null,null,null,"Sobald ein neuer Wettbewerb ausgewählt wird, werden alle vorherigen Eingaben gelöscht. "]

{"sheet":"Daten","index":1,"n_rows":80,"n_cols":29,"rows_kept":80,"cut":false,"hidden":true,"merged":[]}
[null,"Anz Team",null,null,null,null,null,null,null,null,null,null,null,null,null,null,"Startzeiten Vorlauf",null,null,null,null,"Startzeiten ab 2 Runde"]
["Event",null,"Leitung","ort","Strasse","Tel","Fax","E-Mail","meldschluß","startgebühr","vor ort","prostart","spielort1","spielort2","Von","Bis","start1","start2","start3","start4","start5","start6","start7","start8","start9",null,"Iban","Bic","Bank"]
["Trio Damen und Herren",3,"Edgar Müller","63457 Hanau","Wolfstr. 10 ","0170 / 8013807",null,"sektionssportwart-bowling@hkbv-ev.de",null,54,60,16,null,null,null,{"$f":"IF(ISBLANK(O3),\"\",O3+1)","v":""},null,null,null,null,null,null,null,null,null,null,"DE 28 5085 2651 0136 0071 84","HELADEF1DIE","HKBV e.V. - Sektion Bowling   Sparkasse Dieburg"]
["Mixed Doppel",2,"Edgar Müller","63457 Hanau","Wolfstr. 10 ","0170 / 8013807",null,"sektionssportwart-bowling@hkbv-ev.de",{"$f":"O4-8","v":"2021-10-15"},36,40,18,"Linden","Langen","2021-10-23",{"$f":"IF(ISBLANK(O4),\"\",O4+1)","v":"2021-10-24"},"09:00:00","12:30:00","*","Z(nur bei Bedarf)",null,null,null,"16:00:00",null,null,"DE 28 5085 2651 0136 0071 84","HELADEF1DIE","HKBV e.V. - Sektion Bowling   Sparkasse Dieburg"]
["Seniorinnen, Senioren Trio",3,"Luci Wolf","63110 Rodgau","Eugen-Roth-Straße 9","0177 / 3947622",null,"\nsektionsseniorenwart-bowling@hkbv-ev.de",{"$f":"O5-8","v":"2022-01-07"},54,60,22,"Wiesbaden","Eschersheim","2022-01-15","2022-01-16","09:00:00","13:30:00"," ",null,null,null,null,null,null,null,"DE 28 5085 2651 0136 0071 84","HELADEF1DIE","HKBV e.V. - Sektion Bowling   Sparkasse Dieburg"]
["Junioren Einzel",1,"Edgar Müller","63457 Hanau","Wolfstr. 10 ","0170 / 8013807",null,"sektionssportwart-bowling@hkbv-ev.de",null,18,20,null,null,null,"---","---",null,null,null,null,null,null,null,null,null,null,"DE 28 5085 2651 0136 0071 84","HELADEF1DIE","HKBV e.V. - Sektion Bowling   Sparkasse Dieburg"]
["Einzel Damen und Herren",1,"Edgar Müller","63457 Hanau","Wolfstr. 10 ","0170 / 8013807",null,"sektionssportwart-bowling@hkbv-ev.de","2022-03-11",18,20,32,"Mühlheim","Eschersheim","2022-03-19","2022-03-20","09:00:00","12:30:00","16:00:00",null,null,null,null,null,null,null,"DE 28 5085 2651 0136 0071 84","HELADEF1DIE","HKBV e.V. - Sektion Bowling   Sparkasse Dieburg"]
["Jugend Einzel",1,"Gabi Brandes","60529 Frankfurt","Völklingerweg 23","0162 / 9640749",null,"sektionsjugendwart-bowling@hkbv-ev.de",null,20,22,16,null,null,"evtl. 26.2.22","---",null,null,null,null,null,null,null,null,null,null,"DE 28 5085 2651 0136 0071 84","HELADEF1DIE","HKBV e.V. - Sektion Bowling   Sparkasse Dieburg"]
["Seniorinnen, Senioren und Versehrte Einzel",1,"Luci Wolf","63110 Rodgau","Eugen-Roth-Straße 9","0177 / 3947622",null,"\nsektionsseniorenwart-bowling@hkbv-ev.de","2022-01-28",18,20,44,"Wiesbaden","Eschersheim","2022-02-05","2022-02-06","09:00:00","12:40:00","16:20:00",null,null,null,null,null,null,null,"DE 28 5085 2651 0136 0071 84","HELADEF1DIE","HKBV e.V. - Sektion Bowling   Sparkasse Dieburg"]
["Damen und Herren Doppel",2,"Edgar Müller","63457 Hanau","Wolfstr. 10 ","0170 / 8013807",null,"sektionssportwart-bowling@hkbv-ev.de","2022-01-21",36,40,22,"Wiesbaden","Langen","2022-01-29","2022-01-30","09:00:00","12:40:00","*","Z (nur bei Bedarf)",null,null,null,"16:20:00",null,null,"DE 28 5085 2651 0136 0071 84","HELADEF1DIE","HKBV e.V. - Sektion Bowling   Sparkasse Dieburg"]
[]
[]
[]
[]
[]
[]
[]
[]
[]
[]
[]
[]
[]
[null,null,null,null,null,null,null,null,null," "]
[]
[]
["Club"]
[{"$f":"B28&\" \"&D28","v":"8002 AAN Schwanheim"},8002,"KBVS Schwanheim","AAN Schwanheim",null,null,null,null,null,null,null,null,"was"]
["8003 BC Darmstadt",8003,"1. BSV Darmstadt 1973","BC Darmstadt",null,null,null,null,null,null,null,null,"was"]
["8004 BSV Dieburg",8004,"1. BSV Dieburg e.V. 1992","BSV Dieburg",null,null,null,null,null,null,null,null,"was"]
["8005 BC Eberstadt",8005,"1. BSV Eberstadt","BC Eberstadt",null,null,null,null,null,null,null,null,"was"]
["8007 BC 2000 Aschaffenburg",8007,"1. BV Aschaffenburg e.V.","BC 2000 Aschaffenburg",null,null,null,null,null,null,null,null,"was"]
["8009 ABV Frankfurt",8009,"ABV Frankfurt","ABV Frankfurt",null,null,null,null,null,null,null,null,"was"]
["8010 BC Bad Hersfeld",8010,"BC Bad Hersfeld","BC Bad Hersfeld"]
["8011 Cosmos Wiesbaden",8011,"BC Cosmos Wiesbaden","Cosmos Wiesbaden"]
["8019 BSV Oberrad",8019,"BSV 1990 Oberrad","BSV Oberrad"]
["8024 Finale Kassel",8024,"BSV Kassel","Finale Kassel"]
["8025 BC Langen 83",8025,"BSV Langen 83","BC Langen 83"]
["8026 BC Nord West Ffm",8026,"BSV Nord West Frankfurt","BC Nord West Ffm"]
["8027 BV 1987 Frankfurt",8027,"BV 1987 Frankfurt","BV 1987 Frankfurt"]
["8028 BV 77 Frankfurt",8028,"BV 77 Frankfurt","BV 77 Frankfurt"]
["8030 Phönix Frankfurt",8030,"BV 95 Phönix Frankfurt e.V.","Phönix Frankfurt"]
["8031 BC Blau-Gelb Frankfurt",8031,"BV Blau-Gelb Frankfurt e.V.","BC Blau-Gelb Frankfurt"]
["8032 I-Bahn SC 34 Ffm",8032,"BV City Frankfurt","I-Bahn SC 34 Ffm"]
["8033 SBV",8033,"BV City Frankfurt","SBV"]
["8036 BV Frankfurt Süd",8036,"BV Frankfurt Süd","BV Frankfurt Süd"]
["8037 BC 2005 Frankfurt",8037,"BV Frankfurt West","BC 2005 Frankfurt"]
["8038 BC Höchst",8038,"BV Höchst e.V.","BC Höchst"]
["8039 BC Mühlheim",8039,"BV Mühlheim","BC Mühlheim"]
["8041 BC Devils",8041,"BV Oberstedtener Devils e.V.","BC Devils"]
["8042 BV Oranje Frankfurt",8042,"BV Oranje Frankfurt","BV Oranje Frankfurt"]
["8044 BC Rebstock Ffm",8044,"BV Rebstock","BC Rebstock Ffm"]
["8045 BV Römer Frankfurt",8045,"BV Römer Frankfurt","BV Römer Frankfurt"]
["8047 FSV Frankfurt",8047,"FSV Frankfurt","FSV Frankfurt"]
["8048 FTG-BC Frankfurt",8048,"FTG 1847 Frankfurt","FTG-BC Frankfurt"]
["8050 BC 83 Kelsterbach",8050,"KBV Kelsterbach","BC 83 Kelsterbach"]
["8053 Mainhattan Bowlers Frankfurt",8053,"Mainhattan Bowlers Frankfurt","Mainhattan Bowlers Frankfurt"]
["8054 SW Friedberg",8054,"Schwarz Weiss Friedberg","SW Friedberg"]
["8069 BC Wiesbaden",8069,"BC Wiesbaden e.V.","BC Wiesbaden"]
["8072 Bowlingsportclub Bensheim 08 e.V",8072,"Bowlingsportclub Bensheim 08 e.V","Bowlingsportclub Bensheim 08 e.V"]
["8073 Citystrikers",8073,"BC Citystrikers","Citystrikers"]
["8076 BC Gießen",8076,"1. BSV Gießen","BC Gießen"]
["8077 BC 67 Hanau",8077,"BV Hanau","BC 67 Hanau"]
["8078 Condor Steinheim",8078,"BV Hanau","Condor Steinheim"]
["8079 TSV 1860 Hanau",8079,"BV Hanau","TSV 1860 Hanau"]
["8081 BC Fusion Langen e.V.",8081,"BC Fusion Langen e.V.","BC Fusion Langen e.V."]
["8082 BC 75 Fortuna",8082,"BV Hanau","BC 75 Fortuna"]
["8083 1. BV Kelsterbach",8083,"1. BV Kelsterbach e.V.","1. BV Kelsterbach"]
["8084 Queer-Striker",8084,"Frankfurter Volleyball Verein e.V.","Queer-Striker"]
["8085 Blau-Gelb Fulda Strikers",8085,"PSV BG Fulda 1934/61 e.V.","Blau-Gelb Fulda Strikers"]
["26079 BV Pinoy Frankfurt",26079,"BV Pinoy Frankfurt e.V.","BV Pinoy Frankfurt"]
["8087 BBV 2020",8087,"Bensheimer Bowling Verein 2020","BBV 2020"]
[" "]
[" "]
[" "]
[" "]
[" "]
[" "]
[" "]
[" "]

{"sheet":"Stammdaten","index":2,"n_rows":8628,"n_cols":23,"rows_kept":8628,"cut":false,"hidden":true,"merged":[]}
["suchen","Pass_Nr","EDV_Nr","Familienname","VNachname","AK","rangliste","ClubnameRK","VereinsnameRK","RL-Jahr","Jun",8735,"ClubnameRK",null,"suchen","Pass_Nr","EDV_Nr","Familienname","VNachname","AK","rangliste","ClubnameRK","VereinsnameRK"]
[{"$f":"D2&\" \"&C2","v":"Claus 15967"},100651,15967,"Claus","Claus Markus","Herren",null,"BC Darmstadt","1. BSV Darmstadt 1973",20,null,null,"BC Blau-Gelb Frankfurt",null,"Appel 8024",67606,8024,"Appel","Appel Rolf","Sen B",null,"BC Blau-Gelb Frankfurt","BV Blau-Gelb Frankfurt e.V."]
["Diehl 15731",39309,15731,"Diehl","Diehl Karl","Herren",null,"BC Darmstadt","1. BSV Darmstadt 1973",20,null,null,null,null,"Auth 8035",89408,8035,"Auth","Auth Ralf","Sen A",null,"BC Blau-Gelb Frankfurt","BV Blau-Gelb Frankfurt e.V."]
["Dierks 33004",106791,33004,"Dierks","Dierks Carsten","Sen A",null,"BC Darmstadt","1. BSV Darmstadt 1973",21,"Damen",null,null,null,"Bauer 15991",106704,15991,"Bauer","Bauer Dominik","Herren",null,"BC Blau-Gelb Frankfurt","BV Blau-Gelb Frankfurt e.V."]
["Fischer 8318",160,8318,"Fischer","Fischer Rainer","Sen A",null,"BC Darmstadt","1. BSV Darmstadt 1973",21,"Herren",null,null,null,"Baumann 12869",45453,12869,"Baumann","Baumann Norbert","Sen C",null,"BC Blau-Gelb Frankfurt","BV Blau-Gelb Frankfurt e.V."]
["Flaig 8322",100489,8322,"Flaig","Flaig Achim","Sen B",null,"BC Darmstadt","1. BSV Darmstadt 1973",21,"Jug A",null,null,null,"Baumann 12996",33415,12996,"Baumann","Baumann Gabriele","Sen A",null,"BC Blau-Gelb Frankfurt","BV Blau-Gelb Frankfurt e.V."]
["Frost 33237",140148,33237,"Frost","Frost Gerhard","Sen B",null,"BC Darmstadt","1. BSV Darmstadt 1973",21,"Jug B",null,null,null,"Below 21199",149939,21199,"Below","Below Christoph","Herren",null,"BC Blau-Gelb Frankfurt","BV Blau-Gelb Frankfurt e.V."]
["Hartmann 33156",135831,33156,"Hartmann","Hartmann Detlef","Sen B",null,"BC Darmstadt","1. BSV Darmstadt 1973",20,"Jug C",null,null,null,"Bienert 8095",671,8095,"Bienert","Bienert Petra","Sen B",null,"BC Blau-Gelb Frankfurt","BV Blau-Gelb Frankfurt e.V."]
["Herbig 33088",107084,33088,"Herbig","Herbig Andreas","Herren",null,"BC Darmstadt","1. BSV Darmstadt 1973",20,"Sen A",null,null,null,"Dinkel-Klaeden 10576",147298,10576,"Dinkel-Klaeden","Dinkel-Klaeden Brigitte","Sen B",null,"BC Blau-Gelb Frankfurt","BV Blau-Gelb Frankfurt e.V."]
["Kohle 15845",51913,15845,"Kohle","Kohle Richard","Sen C",null,"BC Darmstadt","1. BSV Darmstadt 1973",21,"Sen B",null,null,null,"Firmbach 8307",677,8307,"Firmbach","Firmbach Volker","Sen C",null,"BC Blau-Gelb Frankfurt","BV Blau-Gelb Frankfurt e.V."]
["Schmelz 15104",100493,15104,"Schmelz","Schmelz Peter","Sen B",null,"BC Darmstadt","1. BSV Darmstadt 1973",21,"Sen C",null,null,null,"Geretshauser 8388",67607,8388,"Geretshauser","Geretshauser Kurt","Sen B",null,"BC Blau-Gelb Frankfurt","BV Blau-Gelb Frankfurt e.V."]
["Schmidt 15108",100492,15108,"Schmidt","Schmidt Klaus","Sen B",null,"BC Darmstadt","1. BSV Darmstadt 1973",21,"Versehrte 1",null,null,null,"Gladigau 13056",52081,13056,"Gladigau","Gladigau Philipp","Herren",null,"BC Blau-Gelb Frankfurt","BV Blau-Gelb Frankfurt e.V."]
["Schnellbacher 15703",27466,15703,"Schnellbacher","Schnellbacher Peter","Sen B",null,"BC Darmstadt","1. BSV Darmstadt 1973",21,"Versehrte 2",null,null,null,"Hakin 15813",51304,15813,"Hakin","Hakin Fabio","Herren",null,"BC Blau-Gelb Frankfurt","BV Blau-Gelb Frankfurt e.V."]
["Schreiner 33121",132509,33121,"Schreiner","Schreiner Markus","Herren",null,"BC Darmstadt","1. BSV Darmstadt 1973",21,"Jun",null,null,null,"Hüllenhütter 8571",106556,8571,"Hüllenhütter","Hüllenhütter Wolfgang","Sen B",null,"BC Blau-Gelb Frankfurt","BV Blau-Gelb Frankfurt e.V."]
["Shaghaghi-Kandevani 33260",144510,33260,"Shaghaghi-Kandevani","Shaghaghi-Kandevani Peyman","Sen A",null,"BC Darmstadt","1. BSV Darmstadt 1973",20,null,null,null,null,"Jackwerth 8584",675,8584,"Jackwerth","Jackwerth Klaus","Sen B",null,"BC Blau-Gelb Frankfurt","BV Blau-Gelb Frankfurt e.V."]
["Tezak 15269",100488,15269,"Tezak","Tezak Janko","Sen B",null,"BC Darmstadt","1. BSV Darmstadt 1973",21,null,null,null,null,"Knischewski 8663",676,8663,"Knischewski","Knischewski Petra","Sen C",null,"BC Blau-Gelb Frankfurt","BV Blau-Gelb Frankfurt e.V."]
["Tezak 15912",67337,15912,"Tezak","Tezak Franz","Sen C",null,"BC Darmstadt","1. BSV Darmstadt 1973",21,null,null,null,null,"König 8682",678,8682,"König","König Uta","Sen A",null,"BC Blau-Gelb Frankfurt","BV Blau-Gelb Frankfurt e.V."]
["Wilson 15741",40023,15741,"Wilson","Wilson Joseph","Herren",null,"BC Darmstadt","1. BSV Darmstadt 1973",21,null,null,null,null,"Lamprecht 15918",67387,15918,"Lamprecht","Lamprecht Angelika","Sen B",null,"BC Blau-Gelb Frankfurt","BV Blau-Gelb Frankfurt e.V."]
["Wolf 15757",40181,15757,"Wolf","Wolf Harald","Sen C",null,"BC Darmstadt","1. BSV Darmstadt 1973",20,null,null,null,null,"Mader 8771",543,8771,"Mader","Mader Sven","Herren",null,"BC Blau-Gelb Frankfurt","BV Blau-Gelb Frankfurt e.V."]
["Ackermann 8002",51928,8002,"Ackermann","Ackermann Jürgen","Sen A",null,"BSV Dieburg","1. BSV Dieburg e.V. 1992",22,null,null,null,null,"Müller 8860",51494,8860,"Müller","Müller Susi","Sen A",null,"BC Blau-Gelb Frankfurt","BV Blau-Gelb Frankfurt e.V."]
["Bikowski 15816",39785,15816,"Bikowski","Bikowski Manuel","Herren",null,"BSV Dieburg","1. BSV Dieburg e.V. 1992",21,null,null,null,null,"Muth 8867",681,8867,"Muth","Muth Michael","Sen A",null,"BC Blau-Gelb Frankfurt","BV Blau-Gelb Frankfurt e.V."]
["Da Costa Araujo 33230",140132,33230,"Da Costa Araujo","Da Costa Araujo Carlos","Sen A",null,"BSV Dieburg","1. BSV Dieburg e.V. 1992",22,null,null,null,null,"Naujoks 8870",39667,8870,"Naujoks","Naujoks Angela","Sen B",null,"BC Blau-Gelb Frankfurt","BV Blau-Gelb Frankfurt e.V."]
["Diehl 33316",147249,33316,"Diehl","Diehl Marco","Herren",null,"BSV Dieburg","1. BSV Dieburg e.V. 1992",22,null,null,null,null,"Naumann 8873",682,8873,"Naumann","Naumann Edith","Sen B",null,"BC Blau-Gelb Frankfurt","BV Blau-Gelb Frankfurt e.V."]
["Dürr 33283",146149,33283,"Dürr","Dürr Mathias","Sen A",null,"BSV Dieburg","1. BSV Dieburg e.V. 1992",21,null,null,null,null,"Naumann 8874",683,8874,"Naumann","Naumann Hans-Jürgen","Sen B",null,"BC Blau-Gelb Frankfurt","BV Blau-Gelb Frankfurt e.V."]
["Herling 15698",39201,15698,"Herling","Herling Hagen","Sen A",null,"BSV Dieburg","1. BSV Dieburg e.V. 1992",21,null,null,null,null,"Norz 8896",684,8896,"Norz","Norz Norbert","Sen B",null,"BC Blau-Gelb Frankfurt","BV Blau-Gelb Frankfurt e.V."]
["Krumrey 33180",135926,33180,"Krumrey","Krumrey André","Herren",null,"BSV Dieburg","1. BSV Dieburg e.V. 1992",20,null,null,null,null,"Pohl 15769",39409,15769,"Pohl","Pohl Kanittha","Damen",null,"BC Blau-Gelb Frankfurt","BV Blau-Gelb Frankfurt e.V."]
["Löbig 33268",144468,33268,"Löbig","Löbig Patrick","Herren",null,"BSV Dieburg","1. BSV Dieburg e.V. 1992",21,null,null,null,null,"Reitze 15005",698,15005,"Reitze","Reitze Klaus","Sen B",null,"BC Blau-Gelb Frankfurt","BV Blau-Gelb Frankfurt e.V."]
["Lunkenheimer 8763",144527,8763,"Lunkenheimer","Lunkenheimer Daiana","Sen A",null,"BSV Dieburg","1. BSV Dieburg e.V. 1992",20,null,null,null,null,"Rifinius 15543",227,15543,"Rifinius","Rifinius Irina","Damen",null,"BC Blau-Gelb Frankfurt","BV Blau-Gelb Frankfurt e.V."]
["Müller 33167",135873,33167,"Müller","Müller Alex","Herren",null,"BSV Dieburg","1. BSV Dieburg e.V. 1992",22,null,null,null,null,"Robison 15020",27034,15020,"Robison","Robison Dale","Sen B",null,"BC Blau-Gelb Frankfurt","BV Blau-Gelb Frankfurt e.V."]
["Müller-Steiner 33166",135872,33166,"Müller-Steiner","Müller-Steiner Ernst","Sen B",null,"BSV Dieburg","1. BSV Dieburg e.V. 1992",22,null,null,null,null,"Roloff 15925",67459,15925,"Roloff","Roloff Patrick","Herren",null,"BC Blau-Gelb Frankfurt","BV Blau-Gelb Frankfurt e.V."]
["Popiol 8956",106852,8956,"Popiol","Popiol Bernd","Sen C",null,"BSV Dieburg","1. BSV Dieburg e.V. 1992",22,null,null,null,null,"Roy 15040",699,15040,"Roy","Roy Christopher","Herren",null,"BC Blau-Gelb Frankfurt","BV Blau-Gelb Frankfurt e.V."]
["Popiol 8957",51949,8957,"Popiol","Popiol Christina","Damen",null,"BSV Dieburg","1. BSV Dieburg e.V. 1992",22,null,null,null,null,"Saechtig 10167",142976,10167,"Saechtig","Saechtig Frederic","Herren",null,"BC Blau-Gelb Frankfurt","BV Blau-Gelb Frankfurt e.V."]
["Rückert 15041",100839,15041,"Rückert","Rückert Markus","Sen A",null,"BSV Dieburg","1. BSV Dieburg e.V. 1992",21,null,null,null,null,"Scheibe 10178",107001,10178,"Scheibe","Scheibe Thomas","Sen A",null,"BC Blau-Gelb Frankfurt","BV Blau-Gelb Frankfurt e.V."]
["Ruhlmann 15045",100840,15045,"Ruhlmann","Ruhlmann Thomas","Sen A",null,"BSV Dieburg","1. BSV Dieburg e.V. 1992",22,null,null,null,null,"Schmidt 15112",700,15112,"Schmidt","Schmidt Petra","Sen A",null,"BC Blau-Gelb Frankfurt","BV Blau-Gelb Frankfurt e.V."]
["Spiegler 15209",100841,15209,"Spiegler","Spiegler Bernd","Sen C",null,"BSV Dieburg","1. BSV Dieburg e.V. 1992",22,null,null,null,null,"Sherman 15190",919,15190,"Sherman","Sherman Edward","Sen B",null,"BC Blau-Gelb Frankfurt","BV Blau-Gelb Frankfurt e.V."]
["St. Clair 33312",147249,33312,"St. Clair","St. Clair Sebastian","Herren",null,"BSV Dieburg","1. BSV Dieburg e.V. 1992",21,null,null,null,null,"Siebert 33055",106891,33055,"Siebert","Siebert Björn","Sen A",null,"BC Blau-Gelb Frankfurt","BV Blau-Gelb Frankfurt e.V."]
["Stolz 15758",39537,15758,"Stolz","Stolz Torsten","Sen A",null,"BSV Dieburg","1. BSV Dieburg e.V. 1992",22,null,null,null,null,"Steul 15239",704,15239,"Steul","Steul Karl-Heinz","Sen C",null,"BC Blau-Gelb Frankfurt","BV Blau-Gelb Frankfurt e.V."]
["Stork 33267",144466,33267,"Stork","Stork Volker","Sen A",null,"BSV Dieburg","1. BSV Dieburg e.V. 1992",22,null,null,null,null,"Weidling 15350",88626,15350,"Weidling","Weidling Wolfgang","Sen C",null,"BC Blau-Gelb Frankfurt","BV Blau-Gelb Frankfurt e.V."]
["Vitasovic 15323",100842,15323,"Vitasovic","Vitasovic Kresimir","Sen A",null,"BSV Dieburg","1. BSV Dieburg e.V. 1992",22,null,null,null,null,"Weis 15356",67327,15356,"Weis","Weis Björn","Herren",null,"BC Blau-Gelb Frankfurt","BV Blau-Gelb Frankfurt e.V."]
["Becker 15686",27492,15686,"Becker","Becker Holger","Sen A",null,"BC Eberstadt","1. BSV Eberstadt",21,null,null,null,null,"Weitzel 8785",40131,8785,"Weitzel","Weitzel Cornelia","Damen",null,"BC Blau-Gelb Frankfurt","BV Blau-Gelb Frankfurt e.V."]
["Brookes-Kiefer 8153",27842,8153,"Brookes-Kiefer","Brookes-Kiefer Elaine","Sen B",null,"BC Eberstadt","1. BSV Eberstadt",22,null,null,null,null,"Weitzel 15361",707,15361,"Weitzel","Weitzel Matthias","Sen A",null,"BC Blau-Gelb Frankfurt","BV Blau-Gelb Frankfurt e.V."]
["Franz 33123",132519,33123,"Franz","Franz Eitel","Sen C",null,"BC Eberstadt","1. BSV Eberstadt",22,null,null,null,null,"Wolf 15392",708,15392,"Wolf","Wolf Lucia","Sen B",null,"BC Blau-Gelb Frankfurt","BV Blau-Gelb Frankfurt e.V."]
["Hönicke 33072",107007,33072,"Hönicke","Hönicke Volker","Sen A",null,"BC Eberstadt","1. BSV Eberstadt",20,null,null,null,null,"Wolf 15963",89392,15963,"Wolf","Wolf Klaudia","Sen A",null,"BC Blau-Gelb Frankfurt","BV Blau-Gelb Frankfurt e.V."]
["Kiefer 8639",27694,8639,"Kiefer","Kiefer Michael","Sen B",null,"BC Eberstadt","1. BSV Eberstadt",22,null,null,null,null,"Yowell 15408",709,15408,"Yowell","Yowell Vernon","Sen C",null,"BC Blau-Gelb Frankfurt","BV Blau-Gelb Frankfurt e.V."]
["Kraft 8694",89151,8694,"Kraft","Kraft Edgar","Sen B",null,"BC Eberstadt","1. BSV Eberstadt",22]
["Neubauer 33051",106973,33051,"Neubauer","Neubauer Eva","Sen B",null,"BC Eberstadt","1. BSV Eberstadt",21]
["Schmidt 10331",146189,10331,"Schmidt","Schmidt Markus","Herren",null,"BC Eberstadt","1. BSV Eberstadt",22]
["Schroth 33319",147390,33319,"Schroth","Schroth Manfred","Sen C",null,"BC Eberstadt","1. BSV Eberstadt",22]
["Schwermer 15173",168,15173,"Schwermer","Schwermer Thomas","Sen A",null,"BC Eberstadt","1. BSV Eberstadt",22]
["Seyfarth 10300",106738,10300,"Seyfarth","Seyfarth Robert","Herren",null,"BC Eberstadt","1. BSV Eberstadt",22]
["Stein 15230",27446,15230,"Stein","Stein Angelika","Sen C",null,"BC Eberstadt","1. BSV Eberstadt",22]
["Trebes 15294",100148,15294,"Trebes","Trebes Stefan","Sen A",null,"BC Eberstadt","1. BSV Eberstadt",22]
["Trebes 15295",100149,15295,"Trebes","Trebes Thomas","Sen A",null,"BC Eberstadt","1. BSV Eberstadt",21]
["Balzer 33026",67633,33026,"Balzer","Balzer Phyllis","Jun",null,"BC Gießen","1. BSV Gießen",20]
["Balzer 33043",67664,33043,"Balzer","Balzer Armin","Sen B",null,"BC Gießen","1. BSV Gießen",20]
["Bertsch 15890",67177,15890,"Bertsch","Bertsch Hans-Joachim","Sen B",null,"BC Gießen","1. BSV Gießen",21]
["Beyer 15646",89296,15646,"Beyer","Beyer Petra","Sen B",null,"BC Gießen","1. BSV Gießen",21]
["Biskoping 15704",27456,15704,"Biskoping","Biskoping Robin","Sen A",null,"BC Gießen","1. BSV Gießen",21]
["Braun 8140",67519,8140,"Braun","Braun Hartmut","Sen B",null,"BC Gießen","1. BSV Gießen",21]
["Brieden 33169",135885,33169,"Brieden","Brieden Michael","Herren",null,"BC Gießen","1. BSV Gießen",21]
["Daschmann 8209",88698,8209,"Daschmann","Daschmann Helmut","Sen B",null,"BC Gießen","1. BSV Gießen",21]
["Dorfmeister 8258",null,8258,"Dorfmeister","Dorfmeister Daniel","Herren",null,"BC Gießen","1. BSV Gießen",20]
["Geck 8374",106274,8374,"Geck","Geck Rainer","Sen A",null,"BC Gießen","1. BSV Gießen",21]
["Geck 8689",997,8689,"Geck","Geck Petra","Sen B",null,"BC Gießen","1. BSV Gießen",21]
["Geck 33106",132417,33106,"Geck","Geck Maurice","Herren",null,"BC Gießen","1. BSV Gießen",21]
[{"$f":"D66&\" \"&C66","v":"Gilbert 15644"},1069,15644,"Gilbert","Gilbert Bertram","Sen B",null,"BC Gießen","1. BSV Gießen",21]
["Güldner 8435",100432,8435,"Güldner","Güldner Sascha","Herren",null,"BC Gießen","1. BSV Gießen",21]
["Handtusch 33238",142962,33238,"Handtusch","Handtusch Kai","Jug A",null,"BC Gießen","1. BSV Gießen",21]
["Henrich 8510",142979,8510,"Henrich","Henrich Florian","Herren",null,"BC Gießen","1. BSV Gießen",21]
["Henrich 8511",51303,8511,"Henrich","Henrich Heinz","Sen B",null,"BC Gießen","1. BSV Gießen",21]
["Henrich 8512",51614,8512,"Henrich","Henrich Katharina","Damen",null,"BC Gießen","1. BSV Gießen",20]
["Kehr 6113",39343,6113,"Kehr","Kehr Marco","Sen A",null,"BC Gießen","1. BSV Gießen",21]
["Klassen 33179",135918,33179,"Klassen","Klassen Lukas","Jun",null,"BC Gießen","1. BSV Gießen",21]
["Klassen 33248",143010,33248,"Klassen","Klassen Eugen","Herren",null,"BC Gießen","1. BSV Gießen",21]
["Kolb 33213",14061,33213,"Kolb","Kolb Nadine","Damen",null,"BC Gießen","1. BSV Gießen",21]
["Müller 33329",149135,33329,"Müller","Müller Julian","Herren",null,"BC Gießen","1. BSV Gießen",21]
["Opper 8910",67520,8910,"Opper","Opper Andreas","Sen A",null,"BC Gießen","1. BSV Gießen",21]
["Pest 8938",100673,8938,"Pest","Pest Hagen","Sen A",null,"BC Gießen","1. BSV Gießen",21]
["Rempel 14189",26399,14189,"Rempel","Rempel Kai","Herren",null,"BC Gießen","1. BSV Gießen",21]
["Schneider 15133",67518,15133,"Schneider","Schneider Volker","Sen A",null,"BC Gießen","1. BSV Gießen",21]
["Staab 15215",67272,15215,"Staab","Staab Manfred","Sen B",null,"BC Gießen","1. BSV Gießen",21]
["Teuser 33035",106938,33035,"Teuser","Teuser Franziska","Damen",null,"BC Gießen","1. BSV Gießen",21]
["Toegel-Bertsch 15289",106278,15289,"Toegel-Bertsch","Toegel-Bertsch Sieglinde","Sen B",null,"BC Gießen","1. BSV Gießen",21]
["Wiesner 15375",null,15375,"Wiesner","Wiesner Christoph","Herren",null,"BC Gießen","1. BSV Gießen",21]
["Bernhardt 8090",529,8090,"Bernhardt","Bernhardt Klaus","Sen A",null,"BC 2000 Aschaffenburg","1. BV Aschaffenburg e.V.",21]
["Bruckmann 33068",106999,33068,"Bruckmann","Bruckmann Heike","Sen A",null,"BC 2000 Aschaffenburg","1. BV Aschaffenburg e.V.",21]
["Burgess 33013",106828,33013,"Burgess","Burgess David","Herren",null,"BC 2000 Aschaffenburg","1. BV Aschaffenburg e.V.",21]
["Bürkner 33259",144506,33259,"Bürkner","Bürkner Andrea","Sen B",null,"BC 2000 Aschaffenburg","1. BV Aschaffenburg e.V.",21]
["Fried 33190",135961,33190,"Fried","Fried Dominic","Herren",null,"BC 2000 Aschaffenburg","1. BV Aschaffenburg e.V.",20]
["Fried 33191",135962,33191,"Fried","Fried Sonja","Damen",null,"BC 2000 Aschaffenburg","1. BV Aschaffenburg e.V.",20]
["Frobenius 8356",67270,8356,"Frobenius","Frobenius Sven","Herren",null,"BC 2000 Aschaffenburg","1. BV Aschaffenburg e.V.",21]
["Gröger 33271",144488,33271,"Gröger","Gröger Katrin","Sen A",null,"BC 2000 Aschaffenburg","1. BV Aschaffenburg e.V.",21]
["Heeg 8473",52015,8473,"Heeg","Heeg Renate","Sen A",null,"BC 2000 Aschaffenburg","1. BV Aschaffenburg e.V.",21]
["Heeg 8474",89163,8474,"Heeg","Heeg Sonja","Damen",null,"BC 2000 Aschaffenburg","1. BV Aschaffenburg e.V.",21]
["Heeg 15834",51626,15834,"Heeg","Heeg Heiko","Herren",null,"BC 2000 Aschaffenburg","1. BV Aschaffenburg e.V.",21]
["Hehl 33339",149942,33339,"Hehl","Hehl Günter","Herren",null,"BC 2000 Aschaffenburg","1. BV Aschaffenburg e.V.",21]
["Hein 15833",51625,15833,"Hein","Hein Marco","Sen A",null,"BC 2000 Aschaffenburg","1. BV Aschaffenburg e.V.",20]
["Heininger 33147",135806,33147,"Heininger","Heininger Julia","Damen",null,"BC 2000 Aschaffenburg","1. BV Aschaffenburg e.V.",20]
["Heinrich 33309",147229,33309,"Heinrich","Heinrich Sascha","Jun",null,"BC 2000 Aschaffenburg","1. BV Aschaffenburg e.V.",21]
["Hügin 33114",132472,33114,"Hügin","Hügin Carina","Damen",null,"BC 2000 Aschaffenburg","1. BV Aschaffenburg e.V.",21]
["Inglese 8583",689,8583,"Inglese","Inglese Sandro","Herren",null,"BC 2000 Aschaffenburg","1. BV Aschaffenburg e.V.",21]
["Kornett 10277",144523,10277,"Kornett","Kornett Kerstin","Sen A",null,"BC 2000 Aschaffenburg","1. BV Aschaffenburg e.V.",21]
["Koths 33003",106784,33003,"Koths","Koths Katrin","Sen A",null,"BC 2000 Aschaffenburg","1. BV Aschaffenburg e.V.",21]
["Krebs 15887",66901,15887,"Krebs","Krebs Thomas","Sen A",null,"BC 2000 Aschaffenburg","1. BV Aschaffenburg e.V.",21]
["Krybus 33239",142961,33239,"Krybus","Krybus Peter","Herren",null,"BC 2000 Aschaffenburg","1. BV Aschaffenburg e.V.",20]
["Löffler 33012",106829,33012,"Löffler","Löffler Dieter","Sen A",null,"BC 2000 Aschaffenburg","1. BV Aschaffenburg e.V.",21]
["Manns 33307",147227,33307,"Manns","Manns Madeleine","Damen",null,"BC 2000 Aschaffenburg","1. BV Aschaffenburg e.V.",21]
["Pöhner 8954",106576,8954,"Pöhner","Pöhner Cornelia","Damen",null,"BC 2000 Aschaffenburg","1. BV Aschaffenburg e.V.",21]
["Reckemeier 15398",27905,15398,"Reckemeier","Reckemeier Michaela","Damen",null,"BC 2000 Aschaffenburg","1. BV Aschaffenburg e.V.",21]
["Reuss 15011",67267,15011,"Reuss","Reuss Dominic","Herren",null,"BC 2000 Aschaffenburg","1. BV Aschaffenburg e.V.",21]
["Saalmüller 33334",149851,33334,"Saalmüller","Saalmüller Petra","Damen",null,"BC 2000 Aschaffenburg","1. BV Aschaffenburg e.V.",21]
["Schiller 15087",88705,15087,"Schiller","Schiller Joachim","Sen A",null,"BC 2000 Aschaffenburg","1. BV Aschaffenburg e.V.",21]
["Trebes 33052",106972,33052,"Trebes","Trebes Kerstin","Damen",null,"BC 2000 Aschaffenburg","1. BV Aschaffenburg e.V.",21]
["Tumulka 33308",147228,33308,"Tumulka","Tumulka Johanna","Damen",null,"BC 2000 Aschaffenburg","1. BV Aschaffenburg e.V.",21]
["Bauer 15717",27841,15717,"Bauer","Bauer Hans Jürgen","Sen C",null,"1. BV Kelsterbach","1. BV Kelsterbach e.V.",22]
["Brandes 8138",40042,8138,"Brandes","Brandes Gabriele","Sen A",null,"1. BV Kelsterbach","1. BV Kelsterbach e.V.",22]
["Caldwell 8179",100471,8179,"Caldwell","Caldwell Thomas","Sen A",null,"1. BV Kelsterbach","1. BV Kelsterbach e.V.",22]
["Duplois-Laun 8264",66849,8264,"Duplois-Laun","Duplois-Laun Petra","Sen B",null,"1. BV Kelsterbach","1. BV Kelsterbach e.V.",22]
["Frank 33170",135895,33170,"Frank","Frank Johann-Peter","Sen C",null,"1. BV Kelsterbach","1. BV Kelsterbach e.V.",22]
["Grein 8420",674,8420,"Grein","Grein Michael","Sen B",null,"1. BV Kelsterbach","1. BV Kelsterbach e.V.",22]
["Jerke 33127",132529,33127,"Jerke","Jerke Jonathan","Jug A",null,"1. BV Kelsterbach","1. BV Kelsterbach e.V.",21]
["Korb 33175",135907,33175,"Korb","Korb Daniel","Herren",null,"1. BV Kelsterbach","1. BV Kelsterbach e.V.",22]
["Laun 8735",109,8735,"Laun","Laun Werner","Sen C",null,"1. BV Kelsterbach","1. BV Kelsterbach e.V.",22]
["Nolte 8895",66854,8895,"Nolte","Nolte Joachim","Sen A",null,"1. BV Kelsterbach","1. BV Kelsterbach e.V.",22]
["Reuter 15012",67610,15012,"Reuter","Reuter Agnes","Sen B",null,"1. BV Kelsterbach","1. BV Kelsterbach e.V.",22]
["Rühl 15043",66851,15043,"Rühl","Rühl Marion","Sen B",null,"1. BV Kelsterbach","1. BV Kelsterbach e.V.",22]
["Sabo 15051",39259,15051,"Sabo","Sabo Christine","Sen B",null,"1. BV Kelsterbach","1. BV Kelsterbach e.V.",22]
["Sabo 15052",89132,15052,"Sabo","Sabo Ivan","Sen B",null,"1. BV Kelsterbach","1. BV Kelsterbach e.V.",21]
["Schenke 33097",107137,33097,"Schenke","Schenke Oliver","Herren",null,"1. BV Kelsterbach","1. BV Kelsterbach e.V.",21]
[{"$f":"D130&\" \"&C130","v":"Schönhoff 15472"},66857,15472,"Schönhoff","Schönhoff Andreas","Herren",null,"1. BV Kelsterbach","1. BV Kelsterbach e.V.",21]
["Siemonsen-Caldwell 10366",106953,10366,"Siemonsen-Caldwell","Siemonsen-Caldwell Melanie","Damen",null,"1. BV Kelsterbach","1. BV Kelsterbach e.V.",22]
["Spies 33094",107131,33094,"Spies","Spies Richard","Sen A",null,"1. BV Kelsterbach","1. BV Kelsterbach e.V.",20]
["Viel 33318",147386,33318,"Viel","Viel Winfried","Sen B",null,"1. BV Kelsterbach","1. BV Kelsterbach e.V.",20]
["Ackermann 8001",39675,8001,"Ackermann","Ackermann Brigitte","Sen B",null,"ABV Frankfurt","ABV Frankfurt",22]
["Aufschläger 8029",670,8029,"Aufschläger","Aufschläger Jochen","Sen A",null,"ABV Frankfurt","ABV Frankfurt",22]
["Curti 8204",27602,8204,"Curti","Curti Michael","Herren",null,"ABV Frankfurt","ABV Frankfurt",22]
["Custodio-Simon 8205",106272,8205,"Custodio-Simon","Custodio-Simon Elena","Sen C",null,"ABV Frankfurt","ABV Frankfurt",22]
["Dähler 8208",39673,8208,"Dähler","Dähler Mark","Sen A",null,"ABV Frankfurt","ABV Frankfurt",22]
["Dietz 8922",27467,8922,"Dietz","Dietz Benjamin","Herren",null,"ABV Frankfurt","ABV Frankfurt",22]
["Doczkal 22215",66961,22215,"Doczkal","Doczkal Thomas","Herren",null,"ABV Frankfurt","ABV Frankfurt",22]
["Emmerich 8272",39636,8272,"Emmerich","Emmerich Wolfgang","Sen C",null,"ABV Frankfurt","ABV Frankfurt",22]
["Graf 33188",135959,33188,"Graf","Graf Herta","Sen B",null,"ABV Frankfurt","ABV Frankfurt",22]
["Hartmann 15531",null,15531,"Hartmann","Hartmann Philipp","Herren",null,"ABV Frankfurt","ABV Frankfurt",21]
["Hemmelmann 302",51852,302,"Hemmelmann","Hemmelmann Dirk","Herren",null,"ABV Frankfurt","ABV Frankfurt",22]
["Herre 8521",39676,8521,"Herre","Herre Manuela","Sen B",null,"ABV Frankfurt","ABV Frankfurt",22]
["Hess 8529",null,8529,"Hess","Hess Tobias","Herren",null,"ABV Frankfurt","ABV Frankfurt",22]
["Hübner 15705",27815,15705,"Hübner","Hübner Dennis","Herren",null,"ABV Frankfurt","ABV Frankfurt",21]
["Jost 8608",51609,8608,"Jost","Jost Manfred","Sen A",null,"ABV Frankfurt","ABV Frankfurt",22]
["Koch 8671",39371,8671,"Koch","Koch Robert","Sen A",null,"ABV Frankfurt","ABV Frankfurt",22]
["Laun 8734",66980,8734,"Laun","Laun Stephanie","Damen",null,"ABV Frankfurt","ABV Frankfurt",22]
["Lucke 8759",39664,8759,"Lucke","Lucke Joachim","Sen C",null,"ABV Frankfurt","ABV Frankfurt",22]
["Lucke 8760",39679,8760,"Lucke","Lucke Marc","Sen A",null,"ABV Frankfurt","ABV Frankfurt",22]
["Meurer 8804",67445,8804,"Meurer","Meurer Marius","Herren",null,"ABV Frankfurt","ABV Frankfurt",22]
["Zabelt-Eschert 15411",null,15411,"Zabelt-Eschert","Zabelt-Eschert Rene","Herren",null,"ABV Frankfurt","ABV Frankfurt",22]
["Aquirre 8008",140088,8008,"Aquirre","Aquirre Mark","Sen A",null,"Citystrikers","BC Citystrikers",20]
["Becker 10052",99877,10052,"Becker","Becker Jens","Herren",null,"Citystrikers","BC Citystrikers",20]
["Callsen 8181",27115,8181,"Callsen","Callsen Thomas","Sen A",null,"Citystrikers","BC Citystrikers",22]
["Hampel 33001",51500,33001,"Hampel","Hampel Peter","Sen B",null,"Citystrikers","BC Citystrikers",22]
["Krohn 33254",143037,33254,"Krohn","Krohn Andreas","Herren",null,"Citystrikers","BC Citystrikers",22]
["Mansel 33027",106914,33027,"Mansel","Mansel Klaus","Sen C",null,"Citystrikers","BC Citystrikers",21]
["Meinhardt 371",63491,371,"Meinhardt","Meinhardt Olaf","Sen A",null,"Citystrikers","BC Citystrikers",22]
["Paul 33165",135832,33165,"Paul","Paul Anja","Sen A",null,"Citystrikers","BC Citystrikers",22]
["Pöckler 33187",135958,33187,"Pöckler","Pöckler Maren-Janette","Damen",null,"Citystrikers","BC Citystrikers",22]
["Puder 15987",106692,15987,"Puder","Puder Alexander","Herren",null,"Citystrikers","BC Citystrikers",20]
["Rau 33338",149923,33338,"Rau","Rau Harald","Sen B",null,"Citystrikers","BC Citystrikers",22]
["Rau 33217",140101,33217,"Rau","Rau Oliver","Herren",null,"Citystrikers","BC Citystrikers",22]
["Scholdra 15136",106834,15136,"Scholdra","Scholdra Peter","Sen A",null,"Citystrikers","BC Citystrikers",21]
["Schulz 15865",51323,15865,"Schulz","Schulz Michaela","Sen A",null,"Citystrikers","BC Citystrikers",22]
["Siemon 33215",140087,33215,"Siemon","Siemon Anja","Sen A",null,"Citystrikers","BC Citystrikers",22]
["Spohr 15975",100748,15975,"Spohr","Spohr Philipp","Herren",null,"Citystrikers","BC Citystrikers",21]
["Stephan 33296",147214,33296,"Stephan","Stephan Daniel","Herren",null,"Citystrikers","BC Citystrikers",22]
["Widuckel 15849",51887,15849,"Widuckel","Widuckel Renè","Herren",null,"Citystrikers","BC Citystrikers",21]
["Wolff 33095",107136,33095,"Wolff","Wolff Svenja","Damen",null,"Citystrikers","BC Citystrikers",21]
["Zuhl 15431",1038,15431,"Zuhl","Zuhl Markus","Herren",null,"Citystrikers","BC Citystrikers",20]
["Zuhl 15864",51676,15864,"Zuhl","Zuhl Tanja","Damen",null,"Citystrikers","BC Citystrikers",20]
["Zuhl 15909",67274,15909,"Zuhl","Zuhl Maximilian","Jun",null,"Citystrikers","BC Citystrikers",20]
["Becker-Daschmann 8072",88696,8072,"Becker-Daschmann","Becker-Daschmann Dagmar","Sen A",null,"Cosmos Wiesbaden","BC Cosmos Wiesbaden",22]
["Hüllenhütter 10022",27093,10022,"Hüllenhütter","Hüllenhütter Claudia","Sen B",null,"Cosmos Wiesbaden","BC Cosmos Wiesbaden",22]
["Long 8753",1035,8753,"Long","Long Diana","Sen A",null,"Cosmos Wiesbaden","BC Cosmos Wiesbaden",22]
["Meissner 8796",39677,8796,"Meissner","Meissner Alexandra","Damen",null,"Cosmos Wiesbaden","BC Cosmos Wiesbaden",22]
["Müller 8845",51480,8845,"Müller","Müller Claudia","Sen A",null,"Cosmos Wiesbaden","BC Cosmos Wiesbaden",22]
["Müller 8853",51701,8853,"Müller","Müller Jochen","Sen A",null,"Cosmos Wiesbaden","BC Cosmos Wiesbaden",22]
["Rogat 15027",106555,15027,"Rogat","Rogat Curd","Sen B",null,"Cosmos Wiesbaden","BC Cosmos Wiesbaden",22]
["Steul 15240",705,15240,"Steul","Steul Susan","Sen B",null,"Cosmos Wiesbaden","BC Cosmos Wiesbaden",22]
["Backes 33302",147222,33302,"Backes","Backes Nicolai","Herren",null,"BC Wiesbaden","BC Wiesbaden e.V.",20]
["Bohrmann 8125",106355,8125,"Bohrmann","Bohrmann Berthold","Sen B",null,"BC Wiesbaden","BC Wiesbaden e.V.",21]
["Bohrmann 8126",106356,8126,"Bohrmann","Bohrmann Tim","Herren",null,"BC Wiesbaden","BC Wiesbaden e.V.",21]
["Do 33304",147224,33304,"Do","Do Thanh Binh","Sen A",null,"BC Wiesbaden","BC Wiesbaden e.V.",21]
["Elsenberger 8270",51830,8270,"Elsenberger","Elsenberger Horst","Sen B",null,"BC Wiesbaden","BC Wiesbaden e.V.",21]
["Fischer 10419",144494,10419,"Fischer","Fischer Hendrik","Herren",null,"BC Wiesbaden","BC Wiesbaden e.V.",21]
["Fritz 33222",140114,33222,"Fritz","Fritz Michael","Sen A",null,"BC Wiesbaden","BC Wiesbaden e.V.",21]
["Heimann 33336",149915,33336,"Heimann","Heimann Daniela","Damen",null,"BC Wiesbaden","BC Wiesbaden e.V.",21]
["Horn 33305",147225,33305,"Horn","Horn Thomas","Sen A",null,"BC Wiesbaden","BC Wiesbaden e.V.",20]
[{"$f":"D194&\" \"&C194","v":"Hüllenhütter 33089"},107088,33089,"Hüllenhütter","Hüllenhütter Peter","Sen B",null,"BC Wiesbaden","BC Wiesbaden e.V.",21]
["Könner 8683",51831,8683,"Könner","Könner Horst","Sen A",null,"BC Wiesbaden","BC Wiesbaden e.V.",21]
["Maaß 26427",140119,26427,"Maaß","Maaß Christian","Herren",null,"BC Wiesbaden","BC Wiesbaden e.V.",21]
["Metzroth 33303",147223,33303,"Metzroth","Metzroth Jim","Herren",null,"BC Wiesbaden","BC Wiesbaden e.V.",20]
["Paulin 33301",147221,33301,"Paulin","Paulin Dennis","Herren",null,"BC Wiesbaden","BC Wiesbaden e.V.",20]
["Rabenseifner 15679",27291,15679,"Rabenseifner","Rabenseifner René","Herren",null,"BC Wiesbaden","BC Wiesbaden e.V.",21]
["Schenker 33223",140115,33223,"Schenker","Schenker Raik","Sen A",null,"BC Wiesbaden","BC Wiesbaden e.V.",21]
["Schmitt 33341",151280,33341,"Schmitt","Schmitt Thomas","Herren",null,"BC Wiesbaden","BC Wiesbaden e.V.",21]
["Scholz 33299",147219,33299,"Scholz","Scholz Sebastian","Jun",null,"BC Wiesbaden","BC Wiesbaden e.V.",20]
["Tavares 22116",149997,22116,"Tavares","Tavares Sérgio","Herren",null,"BC Wiesbaden","BC Wiesbaden e.V.",21]
["Teisler 33272",144493,33272,"Teisler","Teisler Lutz","Herren",null,"BC Wiesbaden","BC Wiesbaden e.V.",21]
["Tran 33300",147220,33300,"Tran","Tran Khoi Nguyen","Jug A",null,"BC Wiesbaden","BC Wiesbaden e.V.",21]
["Tran 33306",147226,33306,"Tran","Tran Thi Nhung","Damen",null,"BC Wiesbaden","BC Wiesbaden e.V.",21]
["Vogt 15998",106765,15998,"Vogt","Vogt Michael","Sen A",null,"BC Wiesbaden","BC Wiesbaden e.V.",21]
["Weidl 15349",27760,15349,"Weidl","Weidl Sebastian","Herren",null,"BC Wiesbaden","BC Wiesbaden e.V.",21]
["Deutsch 10653",144519,10653,"Deutsch","Deutsch Jennifer","Damen",null,"BBV 2020 e. V.","Bensheimer Bowling Verein 2020 e.V.",21]
["Deutsch 33262",144518,33262,"Deutsch","Deutsch Wolfgang","Sen B",null,"BBV 2020 e. V.","Bensheimer Bowling Verein 2020 e.V.",21]
["Hebenstreit 33063",106992,33063,"Hebenstreit","Hebenstreit Christina","Damen",null,"BBV 2020 e. V.","Bensheimer Bowling Verein 2020 e.V.",21]
["Jäckel 33211",140059,33211,"Jäckel","Jäckel Dennis","Herren",null,"BBV 2020 e. V.","Bensheimer Bowling Verein 2020 e.V.",21]
["Kastner 33139",132595,33139,"Kastner","Kastner Werner","Sen A",null,"BBV 2020 e. V.","Bensheimer Bowling Verein 2020 e.V.",21]
["Krämer 33141",132593,33141,"Krämer","Krämer Stefan","Herren",null,"BBV 2020 e. V.","Bensheimer Bowling Verein 2020 e.V.",21]
["Kuderna 15904",67240,15904,"Kuderna","Kuderna Alexander","Herren",null,"BBV 2020 e. V.","Bensheimer Bowling Verein 2020 e.V.",21]
["Leonhardt 15793",51110,15793,"Leonhardt","Leonhardt Yves","Sen A",null,"BBV 2020 e. V.","Bensheimer Bowling Verein 2020 e.V.",21]
["Liebitz 33310",147236,33310,"Liebitz","Liebitz Oliver","Herren",null,"BBV 2020 e. V.","Bensheimer Bowling Verein 2020 e.V.",21]
["Mlotek 15954",100355,15954,"Mlotek","Mlotek Marc","Herren",null,"BBV 2020 e. V.","Bensheimer Bowling Verein 2020 e.V.",21]
["Schuster 4377",146182,4377,"Schuster","Schuster Norbert","Sen A",null,"BBV 2020 e. V.","Bensheimer Bowling Verein 2020 e.V.",21]
["Thatcher 15952",100357,15952,"Thatcher","Thatcher Daniel","Herren",null,"BBV 2020 e. V.","Bensheimer Bowling Verein 2020 e.V.",21]
["Czermak 14079",59135,14079,"Czermak","Czermak Wolfgang","Sen A",null,"Bowlingsportclub Bensheim 08 e.V","Bowlingsportclub Bensheim 08 e.V",20]
["Friemer 33279",143122,33279,"Friemer","Friemer Corinna","Damen",null,"Bowlingsportclub Bensheim 08 e.V","Bowlingsportclub Bensheim 08 e.V",20]
["Gaither 33102",132405,33102,"Gaither","Gaither Janette","Damen",null,"Bowlingsportclub Bensheim 08 e.V","Bowlingsportclub Bensheim 08 e.V",20]
["Herweck 14149",146183,14149,"Herweck","Herweck Michael","Herren",null,"Bowlingsportclub Bensheim 08 e.V","Bowlingsportclub Bensheim 08 e.V",20]
["Listmann 15905",67249,15905,"Listmann","Listmann Thorsten","Herren",null,"Bowlingsportclub Bensheim 08 e.V","Bowlingsportclub Bensheim 08 e.V",22]
["Oriakhel 33212",140060,33212,"Oriakhel","Oriakhel Fahim","Jun",null,"Bowlingsportclub Bensheim 08 e.V","Bowlingsportclub Bensheim 08 e.V",22]
["Reich 15837",51681,15837,"Reich","Reich Michael","Sen A",null,"Bowlingsportclub Bensheim 08 e.V","Bowlingsportclub Bensheim 08 e.V",22]
["Reich 15899",67235,15899,"Reich","Reich Peggy","Sen A",null,"Bowlingsportclub Bensheim 08 e.V","Bowlingsportclub Bensheim 08 e.V",22]
["Reich 15900",67236,15900,"Reich","Reich Bianca","Damen",null,"Bowlingsportclub Bensheim 08 e.V","Bowlingsportclub Bensheim 08 e.V",20]
["Weiss 30045",146121,30045,"Weiss","Weiss Holger","Herren",null,"Bowlingsportclub Bensheim 08 e.V","Bowlingsportclub Bensheim 08 e.V",20]
["Westram 15873",52020,15873,"Westram","Westram Boris","Herren",null,"Bowlingsportclub Bensheim 08 e.V","Bowlingsportclub Bensheim 08 e.V",22]
["Wright 15795",51108,15795,"Wright","Wright Claudia","Sen A",null,"Bowlingsportclub Bensheim 08 e.V","Bowlingsportclub Bensheim 08 e.V",21]
["Wright 15796",51109,15796,"Wright","Wright Mark","Sen A",null,"Bowlingsportclub Bensheim 08 e.V","Bowlingsportclub Bensheim 08 e.V",21]
["Bigall 8100",39663,8100,"Bigall","Bigall Marcel","Herren",null,"BSV Oberrad","BSV 1990 Oberrad",22]
["Bigall 8102",39662,8102,"Bigall","Bigall Volker","Sen A",null,"BSV Oberrad","BSV 1990 Oberrad",22]
["Reß 33216",140097,33216,"Reß","Reß Gavino","Sen A",null,"BSV Oberrad","BSV 1990 Oberrad",22]
["Scheuermann 15081",27910,15081,"Scheuermann","Scheuermann Ludwig","Sen B",null,"BSV Oberrad","BSV 1990 Oberrad",22]
["Scholz 15138",39666,15138,"Scholz","Scholz Erhard","Sen B",null,"BSV Oberrad","BSV 1990 Oberrad",21]
["Stapf 15220",66960,15220,"Stapf","Stapf Thorsten","Herren",null,"BSV Oberrad","BSV 1990 Oberrad",22]
["Verdecchia 15318",88625,15318,"Verdecchia","Verdecchia Robert","Sen C",null,"BSV Oberrad","BSV 1990 Oberrad",22]
["Willems 15380",39681,15380,"Willems","Willems Jan","Herren",null,"BSV Oberrad","BSV 1990 Oberrad",22]
["Agerbo 15933",67524,15933,"Agerbo","Agerbo Jesper","Herren",null,"Finale Kassel","BSV Kassel",22]
["Aust 8032",67409,8032,"Aust","Aust Karsten","Herren",null,"Finale Kassel","BSV Kassel",22]
["Beier 28797",104144,28797,"Beier","Beier Tobias","Herren",null,"Finale Kassel","BSV Kassel",21]
["Canady 8183",107078,8183,"Canady","Canady David","Herren",null,"Finale Kassel","BSV Kassel",22]
["Collmann 8196",51890,8196,"Collmann","Collmann Dieter","Sen B",null,"Finale Kassel","BSV Kassel",22]
["Heine 8485",100371,8485,"Heine","Heine Frank","Sen A",null,"Finale Kassel","BSV Kassel",22]
["Heller 8499",51952,8499,"Heller","Heller Roswitha","Sen C",null,"Finale Kassel","BSV Kassel",22]
["Henneberg 33137",132589,33137,"Henneberg","Henneberg Nico","Herren",null,"Finale Kassel","BSV Kassel",22]
["Hernitschek 16386",762478,16386,"Hernitschek","Hernitschek Andreas","Herren",null,"Finale Kassel","BSV Kassel",21]
["Hilgenberg 15602",null,15602,"Hilgenberg","Hilgenberg Björn","Herren",null,"Finale Kassel","BSV Kassel",22]
["Horn 33164",135868,33164,"Horn","Horn Fabien","Herren",null,"Finale Kassel","BSV Kassel",22]
["Hübner 8570",89170,8570,"Hübner","Hübner Rolf","Sen B",null,"Finale Kassel","BSV Kassel",22]
["Jonasdofsky 26146",40323,26146,"Jonasdofsky","Jonasdofsky Mark","Herren",null,"Finale Kassel","BSV Kassel",22]
["Kallup 8619",100433,8619,"Kallup","Kallup Werner","Sen C",null,"Finale Kassel","BSV Kassel",22]
["Kiel 33278",146120,33278,"Kiel","Kiel Manuela","Damen",null,"Finale Kassel","BSV Kassel",22]
["Konieczny 18802",24988,18802,"Konieczny","Konieczny Bodo","Herren",null,"Finale Kassel","BSV Kassel",22]
[{"$f":"D258&\" \"&C258","v":"Lauck 10572"},135941,10572,"Lauck","Lauck Manuel","Herren",null,"Finale Kassel","BSV Kassel",22]
["Mand 15876",51275,15876,"Mand","Mand Lothar","Sen B",null,"Finale Kassel","BSV Kassel",22]
["Moor 15613",441,15613,"Moor","Moor Paul","Herren",null,"Finale Kassel","BSV Kassel",21]
["Morig 24826",109106,24826,"Morig","Morig Oliver","Herren",null,"Finale Kassel","BSV Kassel",21]
["Müller 15972",100344,15972,"Müller","Müller Tobias","Herren",null,"Finale Kassel","BSV Kassel",22]
["Özsoy 33149",135812,33149,"Özsoy","Özsoy Volkan","Herren",null,"Finale Kassel","BSV Kassel",22]
["Raithel 15471",null,15471,"Raithel","Raithel Frank","Sen B",null,"Finale Kassel","BSV Kassel",22]
["Stotz 33257",144503,33257,"Stotz","Stotz Helmut","Herren",null,"Finale Kassel","BSV Kassel",20]
["Stuckert 33246",143003,33246,"Stuckert","Stuckert Willi","Herren",null,"Finale Kassel","BSV Kassel",20]
["Teece 25587",79779,25587,"Teece","Teece Richard","Herren",null,"Finale Kassel","BSV Kassel",21]
["Winternheimer 26157",40294,26157,"Winternheimer","Winternheimer Pascal","Herren",null,"Finale Kassel","BSV Kassel",22]
["Cramer 26594",144522,26594,"Cramer","Cramer Silvio","Jun",null,"BC Langen 83","BSV Langen 83",20]
["Devine 8228",106667,8228,"Devine","Devine David","Sen B",null,"BC Langen 83","BSV Langen 83",21]
["Dietrich 8243",106661,8243,"Dietrich","Dietrich Dieter","Sen B",null,"BC Langen 83","BSV Langen 83",21]
["Dietrich 8244",140109,8244,"Dietrich","Dietrich Timo","Herren",null,"BC Langen 83","BSV Langen 83",20]
["Finn 15889",52085,15889,"Finn","Finn Marco","Herren",null,"BC Langen 83","BSV Langen 83",20]
["Fischer 8315",100460,8315,"Fischer","Fischer Peter","Sen B",null,"BC Langen 83","BSV Langen 83",21]
["Heindl 8484",39282,8484,"Heindl","Heindl Manfred","Sen C",null,"BC Langen 83","BSV Langen 83",21]
["Kimbell 15792",51130,15792,"Kimbell","Kimbell Michael","Herren",null,"BC Langen 83","BSV Langen 83",21]
["Kümpel 33221",140110,33221,"Kümpel","Kümpel Christian","Herren",null,"BC Langen 83","BSV Langen 83",21]
["Neiczer 8875",27807,8875,"Neiczer","Neiczer Ladislaus","Sen B",null,"BC Langen 83","BSV Langen 83",21]
["Rabe 33220",140108,33220,"Rabe","Rabe Thomas","Herren",null,"BC Langen 83","BSV Langen 83",21]
["Schäfer 15064",51533,15064,"Schäfer","Schäfer Jürgen","Sen B",null,"BC Langen 83","BSV Langen 83",21]
["Schley 15099",100462,15099,"Schley","Schley Gisela","Sen B",null,"BC Langen 83","BSV Langen 83",21]
["Schley 15100",51534,15100,"Schley","Schley Hans-Joachim","Sen B",null,"BC Langen 83","BSV Langen 83",21]
["Schuckart-Cramer 26526",144521,26526,"Schuckart-Cramer","Schuckart-Cramer Sascha","Herren",null,"BC Langen 83","BSV Langen 83",20]
["Seipel 15184",100463,15184,"Seipel","Seipel Walter","Sen B",null,"BC Langen 83","BSV Langen 83",21]
["Staudte 33042",106947,33042,"Staudte","Staudte Thomas","Sen A",null,"BC Langen 83","BSV Langen 83",20]
["Staudte 33050",106971,33050,"Staudte","Staudte Anita","Sen B",null,"BC Langen 83","BSV Langen 83",20]
["Völker 15772",39542,15772,"Völker","Völker Terry","Sen B",null,"BC Langen 83","BSV Langen 83",21]
["Büttner 8175",106652,8175,"Büttner","Büttner Stefan","Sen B",null,"BC Nord West Ffm","BSV Nord West Frankfurt",21]
["Obst 8900",106651,8900,"Obst","Obst Mike","Sen A",null,"BC Nord West Ffm","BSV Nord West Frankfurt",21]
["Obst 8901",106650,8901,"Obst","Obst Roland","Sen B",null,"BC Nord West Ffm","BSV Nord West Frankfurt",21]
["Olbrich 8904",106653,8904,"Olbrich","Olbrich Manfred","Sen A",null,"BC Nord West Ffm","BSV Nord West Frankfurt",21]
["Olbrich 15892",67428,15892,"Olbrich","Olbrich Bernd","Sen A",null,"BC Nord West Ffm","BSV Nord West Frankfurt",21]
["Tippmann 15287",106649,15287,"Tippmann","Tippmann Harry","Sen C",null,"BC Nord West Ffm","BSV Nord West Frankfurt",21]
["Uhlig 15305",100689,15305,"Uhlig","Uhlig Donald","Sen B",null,"BC Nord West Ffm","BSV Nord West Frankfurt",21]
["Arold 15530",140,15530,"Arold","Arold Daniel","Herren",null,"BV 1987 Frankfurt","BV 1987 Frankfurt",21]
["Barth 8046",106332,8046,"Barth","Barth Marcel","Sen A",null,"BV 1987 Frankfurt","BV 1987 Frankfurt",21]
["Catibog 3288",130764,3288,"Catibog","Catibog Ernesto","Herren",null,"BV 1987 Frankfurt","BV 1987 Frankfurt",21]
["Dengs 8220",106334,8220,"Dengs","Dengs Heinz","Sen B",null,"BV 1987 Frankfurt","BV 1987 Frankfurt",21]
["Doffin 15675",27440,15675,"Doffin","Doffin Wolfgang","Sen B",null,"BV 1987 Frankfurt","BV 1987 Frankfurt",21]
["Gallus 33295",147212,33295,"Gallus","Gallus Peter","Herren",null,"BV 1987 Frankfurt","BV 1987 Frankfurt",20]
["Gebhardt 8371",624,8371,"Gebhardt","Gebhardt Carsten","Herren",null,"BV 1987 Frankfurt","BV 1987 Frankfurt",21]
["Haase 15803",51192,15803,"Haase","Haase Reiner","Sen B",null,"BV 1987 Frankfurt","BV 1987 Frankfurt",21]
["Kärmer 15570",283,15570,"Kärmer","Kärmer Björn","Herren",null,"BV 1987 Frankfurt","BV 1987 Frankfurt",21]
["Mader 8769",106335,8769,"Mader","Mader Gabi","Sen A",null,"BV 1987 Frankfurt","BV 1987 Frankfurt",21]
["Malow 15859",51970,15859,"Malow","Malow Marco","Sen A",null,"BV 1987 Frankfurt","BV 1987 Frankfurt",21]
["Rahner 15674",27439,15674,"Rahner","Rahner Viktor","Sen A",null,"BV 1987 Frankfurt","BV 1987 Frankfurt",21]
["Reinfelder 33294",147211,33294,"Reinfelder","Reinfelder Patrick","Herren",null,"BV 1987 Frankfurt","BV 1987 Frankfurt",21]
["Schinkario 15094",106337,15094,"Schinkario","Schinkario Nicole","Damen",null,"BV 1987 Frankfurt","BV 1987 Frankfurt",21]
["Schröder 15577",51115,15577,"Schröder","Schröder Philip","Herren",null,"BV 1987 Frankfurt","BV 1987 Frankfurt",21]
["Schubert 15151",106988,15151,"Schubert","Schubert Mike","Herren",null,"BV 1987 Frankfurt","BV 1987 Frankfurt",21]
["Struth 15257",27253,15257,"Struth","Struth Harald","Sen B",null,"BV 1987 Frankfurt","BV 1987 Frankfurt",21]
["Tardt 15264",544,15264,"Tardt","Tardt Axel","Sen B",null,"BV 1987 Frankfurt","BV 1987 Frankfurt",21]
["Vogel 15324",99942,15324,"Vogel","Vogel Bernd","Sen B",null,"BV 1987 Frankfurt","BV 1987 Frankfurt",21]
["Winter 10068",106984,10068,"Winter","Winter Asko","Sen A",null,"BV 1987 Frankfurt","BV 1987 Frankfurt",21]
["Barth 8045",530,8045,"Barth","Barth Jeannine","Damen",null,"BV 77 Frankfurt","BV 77 Frankfurt",21]
["Beckel 8064",106604,8064,"Beckel","Beckel Martina","Sen B",null,"BV 77 Frankfurt","BV 77 Frankfurt",21]
["Blank 24604",55304,24604,"Blank","Blank Kathrin","Damen",null,"BV 77 Frankfurt","BV 77 Frankfurt",21]
["Bristot 8463",140106,8463,"Bristot","Bristot Andrea","Damen",null,"BV 77 Frankfurt","BV 77 Frankfurt",20]
["Castro 8188",12754,8188,"Castro","Castro Ferdinand","Herren",null,"BV 77 Frankfurt","BV 77 Frankfurt",21]
["Dengs 33313",147353,33313,"Dengs","Dengs Kevin","Herren",null,"BV 77 Frankfurt","BV 77 Frankfurt",21]
["Dengs 33314",147352,33314,"Dengs","Dengs Marco","Herren",null,"BV 77 Frankfurt","BV 77 Frankfurt",21]
[{"$f":"D322&\" \"&C322","v":"Filor 8399"},39338,8399,"Filor","Filor Alexandra","Damen",null,"BV 77 Frankfurt","BV 77 Frankfurt",21]
["Fuertes 8359",106606,8359,"Fuertes","Fuertes Alfonso","Sen C",null,"BV 77 Frankfurt","BV 77 Frankfurt",21]
["Fuertes 8360",67493,8360,"Fuertes","Fuertes Daniel","Herren",null,"BV 77 Frankfurt","BV 77 Frankfurt",21]
["Göbel - Janka 8403",39339,8403,"Göbel - Janka","Göbel - Janka Michaela","Damen",null,"BV 77 Frankfurt","BV 77 Frankfurt",21]
["Henrich 8514",67314,8514,"Henrich","Henrich Sven","Herren",null,"BV 77 Frankfurt","BV 77 Frankfurt",21]
["Krüger 10439",132498,10439,"Krüger","Krüger Wilhelm","Herren",null,"BV 77 Frankfurt","BV 77 Frankfurt",21]
["Meissner 9042",147391,9042,"Meissner","Meissner Jennifer","Damen",null,"BV 77 Frankfurt","BV 77 Frankfurt",20]
["Poller 8955",106607,8955,"Poller","Poller Armin","Sen A",null,"BV 77 Frankfurt","BV 77 Frankfurt",21]
["Poller 15596",27352,15596,"Poller","Poller Elke","Sen A",null,"BV 77 Frankfurt","BV 77 Frankfurt",21]
["Rogalla 33150",135816,33150,"Rogalla","Rogalla Frank","Sen B",null,"BV 77 Frankfurt","BV 77 Frankfurt",21]
["Sawicki 31298",12281,31298,"Sawicki","Sawicki Claudia","Damen",null,"BV 77 Frankfurt","BV 77 Frankfurt",21]
["Weibrich 26632",127769,26632,"Weibrich","Weibrich Florentine","Jun",null,"BV 77 Frankfurt","BV 77 Frankfurt",21]
["Wiederhold 15766",39421,15766,"Wiederhold","Wiederhold Alexander","Herren",null,"BV 77 Frankfurt","BV 77 Frankfurt",21]
["Berk 23125",100322,23125,"Berk","Berk Johannes","Sen B",null,"Phönix Frankfurt","BV 95 Phönix Frankfurt e.V.",21]
["Crider 2220",127794,2220,"Crider","Crider Marshal","Herren",null,"Phönix Frankfurt","BV 95 Phönix Frankfurt e.V.",21]
["Dietz 8245",52031,8245,"Dietz","Dietz Christian","Herren",null,"Phönix Frankfurt","BV 95 Phönix Frankfurt e.V.",21]
["Flick 15804",51196,15804,"Flick","Flick Peter Uwe","Sen B",null,"Phönix Frankfurt","BV 95 Phönix Frankfurt e.V.",21]
["Friedrichs 22176",145765,22176,"Friedrichs","Friedrichs Tim","Herren",null,"Phönix Frankfurt","BV 95 Phönix Frankfurt e.V.",21]
["Gallo 33092",107121,33092,"Gallo","Gallo Adrian","Jun",null,"Phönix Frankfurt","BV 95 Phönix Frankfurt e.V.",21]
["Kompauer 8681",27759,8681,"Kompauer","Kompauer Sven","Herren",null,"Phönix Frankfurt","BV 95 Phönix Frankfurt e.V.",20]
["Modenbach 8825",67609,8825,"Modenbach","Modenbach Christian","Sen B",null,"Phönix Frankfurt","BV 95 Phönix Frankfurt e.V.",21]
["Neß 15653",27045,15653,"Neß","Neß Daniel","Herren",null,"Phönix Frankfurt","BV 95 Phönix Frankfurt e.V.",21]
["Ray Love II 14165",105121,14165,"Ray Love II","Ray Love II Gloster","Herren",null,"Phönix Frankfurt","BV 95 Phönix Frankfurt e.V.",21]
["Rohn 33036",106939,33036,"Rohn","Rohn Jörg","Herren",null,"Phönix Frankfurt","BV 95 Phönix Frankfurt e.V.",21]
["Schneider 26661",127904,26661,"Schneider","Schneider Dennis","Jug A",null,"Phönix Frankfurt","BV 95 Phönix Frankfurt e.V.",20]
["Schneider 26662",127909,26662,"Schneider","Schneider Max","Jug A",null,"Phönix Frankfurt","BV 95 Phönix Frankfurt e.V.",20]
["Schubert 15992",107101,15992,"Schubert","Schubert Nick","Jun",null,"Phönix Frankfurt","BV 95 Phönix Frankfurt e.V.",21]
["Spelten 33258",144508,33258,"Spelten","Spelten Christopher","Jun",null,"Phönix Frankfurt","BV 95 Phönix Frankfurt e.V.",21]
["Stichling 218",3950,218,"Stichling","Stichling Christopher","Herren",null,"Phönix Frankfurt","BV 95 Phönix Frankfurt e.V.",21]
["Winter 14091",26188,14091,"Winter","Winter Florian","Herren",null,"Phönix Frankfurt","BV 95 Phönix Frankfurt e.V.",21]
["Appel 8024",67606,8024,"Appel","Appel Rolf","Sen B",null,"BC Blau-Gelb Frankfurt","BV Blau-Gelb Frankfurt e.V.",22]
["Auth 8035",89408,8035,"Auth","Auth Ralf","Sen A",null,"BC Blau-Gelb Frankfurt","BV Blau-Gelb Frankfurt e.V.",22]
["Bauer 15991",106704,15991,"Bauer","Bauer Dominik","Herren",null,"BC Blau-Gelb Frankfurt","BV Blau-Gelb Frankfurt e.V.",22]
["Baumann 12869",45453,12869,"Baumann","Baumann Norbert","Sen C",null,"BC Blau-Gelb Frankfurt","BV Blau-Gelb Frankfurt e.V.",22]
["Baumann 12996",33415,12996,"Baumann","Baumann Gabriele","Sen A",null,"BC Blau-Gelb Frankfurt","BV Blau-Gelb Frankfurt e.V.",22]
["Below 21199",149939,21199,"Below","Below Christoph","Herren",null,"BC Blau-Gelb Frankfurt","BV Blau-Gelb Frankfurt e.V.",22]
["Bienert 8095",671,8095,"Bienert","Bienert Petra","Sen B",null,"BC Blau-Gelb Frankfurt","BV Blau-Gelb Frankfurt e.V.",22]
["Dinkel-Klaeden 10576",147298,10576,"Dinkel-Klaeden","Dinkel-Klaeden Brigitte","Sen B",null,"BC Blau-Gelb Frankfurt","BV Blau-Gelb Frankfurt e.V.",21]
["Firmbach 8307",677,8307,"Firmbach","Firmbach Volker","Sen C",null,"BC Blau-Gelb Frankfurt","BV Blau-Gelb Frankfurt e.V.",22]
["Geretshauser 8388",67607,8388,"Geretshauser","Geretshauser Kurt","Sen B",null,"BC Blau-Gelb Frankfurt","BV Blau-Gelb Frankfurt e.V.",22]
["Gladigau 13056",52081,13056,"Gladigau","Gladigau Philipp","Herren",null,"BC Blau-Gelb Frankfurt","BV Blau-Gelb Frankfurt e.V.",22]
["Hakin 15813",51304,15813,"Hakin","Hakin Fabio","Herren",null,"BC Blau-Gelb Frankfurt","BV Blau-Gelb Frankfurt e.V.",20]
["Hüllenhütter 8571",106556,8571,"Hüllenhütter","Hüllenhütter Wolfgang","Sen B",null,"BC Blau-Gelb Frankfurt","BV Blau-Gelb Frankfurt e.V.",22]
["Jackwerth 8584",675,8584,"Jackwerth","Jackwerth Klaus","Sen B",null,"BC Blau-Gelb Frankfurt","BV Blau-Gelb Frankfurt e.V.",22]
["Knischewski 8663",676,8663,"Knischewski","Knischewski Petra","Sen C",null,"BC Blau-Gelb Frankfurt","BV Blau-Gelb Frankfurt e.V.",22]
["König 8682",678,8682,"König","König Uta","Sen A",null,"BC Blau-Gelb Frankfurt","BV Blau-Gelb Frankfurt e.V.",22]
["Lamprecht 15918",67387,15918,"Lamprecht","Lamprecht Angelika","Sen B",null,"BC Blau-Gelb Frankfurt","BV Blau-Gelb Frankfurt e.V.",21]
["Mader 8771",543,8771,"Mader","Mader Sven","Herren",null,"BC Blau-Gelb Frankfurt","BV Blau-Gelb Frankfurt e.V.",22]
["Müller 8860",51494,8860,"Müller","Müller Susi","Sen A",null,"BC Blau-Gelb Frankfurt","BV Blau-Gelb Frankfurt e.V.",21]
["Muth 8867",681,8867,"Muth","Muth Michael","Sen A",null,"BC Blau-Gelb Frankfurt","BV Blau-Gelb Frankfurt e.V.",22]
["Naujoks 8870",39667,8870,"Naujoks","Naujoks Angela","Sen B",null,"BC Blau-Gelb Frankfurt","BV Blau-Gelb Frankfurt e.V.",22]
["Naumann 8873",682,8873,"Naumann","Naumann Edith","Sen B",null,"BC Blau-Gelb Frankfurt","BV Blau-Gelb Frankfurt e.V.",22]
["Naumann 8874",683,8874,"Naumann","Naumann Hans-Jürgen","Sen B",null,"BC Blau-Gelb Frankfurt","BV Blau-Gelb Frankfurt e.V.",22]
["Norz 8896",684,8896,"Norz","Norz Norbert","Sen B",null,"BC Blau-Gelb Frankfurt","BV Blau-Gelb Frankfurt e.V.",22]
["Pohl 15769",39409,15769,"Pohl","Pohl Kanittha","Damen",null,"BC Blau-Gelb Frankfurt","BV Blau-Gelb Frankfurt e.V.",22]
["Reitze 15005",698,15005,"Reitze","Reitze Klaus","Sen B",null,"BC Blau-Gelb Frankfurt","BV Blau-Gelb Frankfurt e.V.",22]
["Rifinius 15543",227,15543,"Rifinius","Rifinius Irina","Damen",null,"BC Blau-Gelb Frankfurt","BV Blau-Gelb Frankfurt e.V.",22]
["Robison 15020",27034,15020,"Robison","Robison Dale","Sen B",null,"BC Blau-Gelb Frankfurt","BV Blau-Gelb Frankfurt e.V.",22]
["Roloff 15925",67459,15925,"Roloff","Roloff Patrick","Herren",null,"BC Blau-Gelb Frankfurt","BV Blau-Gelb Frankfurt e.V.",21]
["Roy 15040",699,15040,"Roy","Roy Christopher","Herren",null,"BC Blau-Gelb Frankfurt","BV Blau-Gelb Frankfurt e.V.",22]
["Saechtig 10167",142976,10167,"Saechtig","Saechtig Frederic","Herren",null,"BC Blau-Gelb Frankfurt","BV Blau-Gelb Frankfurt e.V.",22]
["Scheibe 10178",107001,10178,"Scheibe","Scheibe Thomas","Sen A",null,"BC Blau-Gelb Frankfurt","BV Blau-Gelb Frankfurt e.V.",20]
["Schmidt 15112",700,15112,"Schmidt","Schmidt Petra","Sen A",null,"BC Blau-Gelb Frankfurt","BV Blau-Gelb Frankfurt e.V.",22]
["Sherman 15190",919,15190,"Sherman","Sherman Edward","Sen B",null,"BC Blau-Gelb Frankfurt","BV Blau-Gelb Frankfurt e.V.",22]
[{"$f":"D386&\" \"&C386","v":"Siebert 33055"},106891,33055,"Siebert","Siebert Björn","Sen A",null,"BC Blau-Gelb Frankfurt","BV Blau-Gelb Frankfurt e.V.",21]
["Steul 15239",704,15239,"Steul","Steul Karl-Heinz","Sen C",null,"BC Blau-Gelb Frankfurt","BV Blau-Gelb Frankfurt e.V.",21]
["Weidling 15350",88626,15350,"Weidling","Weidling Wolfgang","Sen C",null,"BC Blau-Gelb Frankfurt","BV Blau-Gelb Frankfurt e.V.",22]
["Weis 15356",67327,15356,"Weis","Weis Björn","Herren",null,"BC Blau-Gelb Frankfurt","BV Blau-Gelb Frankfurt e.V.",21]
["Weitzel 8785",40131,8785,"Weitzel","Weitzel Cornelia","Damen",null,"BC Blau-Gelb Frankfurt","BV Blau-Gelb Frankfurt e.V.",21]
["Weitzel 15361",707,15361,"Weitzel","Weitzel Matthias","Sen A",null,"BC Blau-Gelb Frankfurt","BV Blau-Gelb Frankfurt e.V.",20]
["Wolf 15392",708,15392,"Wolf","Wolf Lucia","Sen B",null,"BC Blau-Gelb Frankfurt","BV Blau-Gelb Frankfurt e.V.",22]
["Wolf 15963",89392,15963,"Wolf","Wolf Klaudia","Sen A",null,"BC Blau-Gelb Frankfurt","BV Blau-Gelb Frankfurt e.V.",20]
["Yowell 15408",709,15408,"Yowell","Yowell Vernon","Sen C",null,"BC Blau-Gelb Frankfurt","BV Blau-Gelb Frankfurt e.V.",22]
["Blickhan 8111",27575,8111,"Blickhan","Blickhan Richard","Sen B",null,"BV Frankfurt Süd","BV Frankfurt Süd",21]
["Gutzwiller 33163",135861,33163,"Gutzwiller","Gutzwiller Stephan","Sen A",null,"BV Frankfurt Süd","BV Frankfurt Süd",20]
["Morche 8839",67740,8839,"Morche","Morche Jochen","Sen B",null,"BV Frankfurt Süd","BV Frankfurt Süd",21]
["Regenfuss 8990",461,8990,"Regenfuss","Regenfuss Norbert","Sen C",null,"BV Frankfurt Süd","BV Frankfurt Süd",21]
["Scharnowski 15070",67741,15070,"Scharnowski","Scharnowski Waldemar","Herren",null,"BV Frankfurt Süd","BV Frankfurt Süd",21]
["Vogelrieder 33049",106970,33049,"Vogelrieder","Vogelrieder Josef","Sen C",null,"BV Frankfurt Süd","BV Frankfurt Süd",21]
["Altunok 33002",106785,33002,"Altunok","Altunok Ümit","Herren",null,"BC 67 Hanau","BV Hanau",21]
["Baro 10029",104782,10029,"Baro","Baro Dirk","Sen A",null,"BC 67 Hanau","BV Hanau",21]
["Druschel 8261",51961,8261,"Druschel","Druschel Siegfried","Sen B",null,"BC 67 Hanau","BV Hanau",20]
["Fernandez 8297",67191,8297,"Fernandez","Fernandez Andres","Sen C",null,"BC 67 Hanau","BV Hanau",21]
["Gehrmann 26507",84857,26507,"Gehrmann","Gehrmann René","Herren",null,"BC 67 Hanau","BV Hanau",21]
["Härtl 15555",305,15555,"Härtl","Härtl Rudolf","Sen B",null,"BC 67 Hanau","BV Hanau",21]
["Harzer 33273",144496,33273,"Harzer","Harzer Christopher","Herren",null,"BC 67 Hanau","BV Hanau",21]
["Hein 15520",79845,15520,"Hein","Hein Karsten","Herren",null,"BC 67 Hanau","BV Hanau",21]
["Heldner 8493",89108,8493,"Heldner","Heldner Bruno","Sen B",null,"BC 67 Hanau","BV Hanau",21]
["Knöchel 33274",144497,33274,"Knöchel","Knöchel Frank","Sen A",null,"BC 67 Hanau","BV Hanau",21]
["Konway 8684",89110,8684,"Konway","Konway Karl","Sen A",null,"BC 67 Hanau","BV Hanau",21]
["Müller 8849",89111,8849,"Müller","Müller Edgar","Sen B",null,"BC 67 Hanau","BV Hanau",21]
["Rousselange 15825",51616,15825,"Rousselange","Rousselange Florian","Herren",null,"BC 67 Hanau","BV Hanau",21]
["Vorwerg 10067",null,10067,"Vorwerg","Vorwerg Michael","Sen A",null,"BC 67 Hanau","BV Hanau",21]
["Zabel 15410",null,15410,"Zabel","Zabel Manfred","Sen B",null,"BC 67 Hanau","BV Hanau",21]
["Bayer 8055",39641,8055,"Bayer","Bayer Harry","Sen B",null,"BC 75 Fortuna","BV Hanau",22]
["Bayer 8057",27046,8057,"Bayer","Bayer Peter","Sen B",null,"BC 75 Fortuna","BV Hanau",22]
["Brückner 8156",100737,8156,"Brückner","Brückner Achim","Sen B",null,"BC 75 Fortuna","BV Hanau",22]
["Färber 8283",100739,8283,"Färber","Färber Klaus","Sen C",null,"BC 75 Fortuna","BV Hanau",22]
["Gruchot 10369",107041,10369,"Gruchot","Gruchot Dennis","Herren",null,"BC 75 Fortuna","BV Hanau",22]
["Klein 33168",135883,33168,"Klein","Klein Horst","Sen B",null,"BC 75 Fortuna","BV Hanau",22]
["Marquardt 33327",149070,33327,"Marquardt","Marquardt Jens","Herren",null,"BC 75 Fortuna","BV Hanau",22]
["Naujoks 8871",27761,8871,"Naujoks","Naujoks Christoph","Herren",null,"BC 75 Fortuna","BV Hanau",22]
["Naujoks 8872",27762,8872,"Naujoks","Naujoks Jürgen","Sen B",null,"BC 75 Fortuna","BV Hanau",22]
["Neumann 8885",40028,8885,"Neumann","Neumann Heike","Sen A",null,"BC 75 Fortuna","BV Hanau",22]
["Schendel 15074",100740,15074,"Schendel","Schendel Jörg","Sen A",null,"BC 75 Fortuna","BV Hanau",22]
["Schmidt 15111",27755,15111,"Schmidt","Schmidt Peter","Sen B",null,"BC 75 Fortuna","BV Hanau",22]
["Serowy 15189",100738,15189,"Serowy","Serowy Gerd","Sen B",null,"BC 75 Fortuna","BV Hanau",22]
["Syla 10409",135978,10409,"Syla","Syla Tania","Damen",null,"BC 75 Fortuna","BV Hanau",22]
["Bauer 8051",107012,8051,"Bauer","Bauer Jürgen","Sen B",null,"Condor Steinheim","BV Hanau",22]
["Bayer 8056",89118,8056,"Bayer","Bayer Julia","Damen",null,"Condor Steinheim","BV Hanau",22]
["Bayer 8058",89119,8058,"Bayer","Bayer Thomas","Sen A",null,"Condor Steinheim","BV Hanau",22]
["Bretthauer 8147",135896,8147,"Bretthauer","Bretthauer Ralf","Sen B",null,"Condor Steinheim","BV Hanau",22]
["Buhl 8166",89122,8166,"Buhl","Buhl Georg","Sen C",null,"Condor Steinheim","BV Hanau",22]
["Buhl 8167",89121,8167,"Buhl","Buhl Martin","Herren",null,"Condor Steinheim","BV Hanau",22]
["Dreher 10026",89116,10026,"Dreher","Dreher Stefan","Sen B",null,"Condor Steinheim","BV Hanau",20]
["Friedrich 8349",51622,8349,"Friedrich","Friedrich Michael","Sen B",null,"Condor Steinheim","BV Hanau",22]
["Friedrich 8348",40058,8348,"Friedrich","Friedrich Heike","Sen A",null,"Condor Steinheim","BV Hanau",21]
["Glock 33264",144528,33264,"Glock","Glock Daniel","Herren",null,"Condor Steinheim","BV Hanau",22]
["Göb 8398",89117,8398,"Göb","Göb Patrick","Herren",null,"Condor Steinheim","BV Hanau",22]
["Grünheid 33098",107146,33098,"Grünheid","Grünheid Malte","Herren",null,"Condor Steinheim","BV Hanau",21]
["Grünheid 33148",135807,33148,"Grünheid","Grünheid Uwe","Sen C",null,"Condor Steinheim","BV Hanau",22]
["Kleppig 8661",89123,8661,"Kleppig","Kleppig Constanze","Sen A",null,"Condor Steinheim","BV Hanau",22]
["Klüh 10261",132408,10261,"Klüh","Klüh Heidi","Sen B",null,"Condor Steinheim","BV Hanau",20]
["Pauli 8927",109627,8927,"Pauli","Pauli Sven","Herren",null,"Condor Steinheim","BV Hanau",22]
["Schlappa 15097",89127,15097,"Schlappa","Schlappa Norbert","Sen B",null,"Condor Steinheim","BV Hanau",22]
["Schlappa 15098",89126,15098,"Schlappa","Schlappa Wolfgang","Herren",null,"Condor Steinheim","BV Hanau",22]
["Schmidt 15123",67193,15123,"Schmidt","Schmidt Thomas","Herren",null,"Condor Steinheim","BV Hanau",20]
["Sommer 15203",89130,15203,"Sommer","Sommer Walter","Sen B",null,"Condor Steinheim","BV Hanau",21]
[{"$f":"D450&\" \"&C450","v":"Beumer 15569"},528,15569,"Beumer","Beumer Christoph","Sen A",null,"TSV 1860 Hanau","BV Hanau",22]
["Braun 10560",146198,10560,"Braun","Braun Cornelia","Sen A",null,"TSV 1860 Hanau","BV Hanau",22]
["Brückner 33290",146196,33290,"Brückner","Brückner Benedikt","Herren",null,"TSV 1860 Hanau","BV Hanau",22]
["Celerino 33298",147240,33298,"Celerino","Celerino Antonio","Sen A",null,"TSV 1860 Hanau","BV Hanau",21]
["Freund 8345",147239,8345,"Freund","Freund Matthias","Sen A",null,"TSV 1860 Hanau","BV Hanau",22]
["Große 15541",186,15541,"Große","Große Christina","Damen",null,"TSV 1860 Hanau","BV Hanau",22]
["Heck-Seipel 8471",100029,8471,"Heck-Seipel","Heck-Seipel Lydia","Sen C",null,"TSV 1860 Hanau","BV Hanau",22]
["Heilmann 8480",89091,8480,"Heilmann","Heilmann Harry","Sen B",null,"TSV 1860 Hanau","BV Hanau",22]
["Heilmann 8481",89092,8481,"Heilmann","Heilmann Inge","Sen B",null,"TSV 1860 Hanau","BV Hanau",22]
["Herbert 15861",51956,15861,"Herbert","Herbert Peter","Sen B",null,"TSV 1860 Hanau","BV Hanau",21]
["Jokisch 8606",27047,8606,"Jokisch","Jokisch Matthias","Sen A",null,"TSV 1860 Hanau","BV Hanau",22]
["Kitzinger 33340",151173,33340,"Kitzinger","Kitzinger Leonard","Jun",null,"TSV 1860 Hanau","BV Hanau",22]
["Klier 8662",89094,8662,"Klier","Klier Reinhard","Sen B",null,"TSV 1860 Hanau","BV Hanau",22]
["Körber 18938",39952,18938,"Körber","Körber Martina","Sen A",null,"TSV 1860 Hanau","BV Hanau",21]
["Kraus 8697",89095,8697,"Kraus","Kraus Monika","Sen B",null,"TSV 1860 Hanau","BV Hanau",22]
["Krug 33037",106940,33037,"Krug","Krug Reiner","Herren",null,"TSV 1860 Hanau","BV Hanau",21]
["Krüger 15461",89098,15461,"Krüger","Krüger Petra","Sen A",null,"TSV 1860 Hanau","BV Hanau",22]
["Krüger 15462",100474,15462,"Krüger","Krüger Michael","Sen B",null,"TSV 1860 Hanau","BV Hanau",21]
["Krüger 15497",100472,15497,"Krüger","Krüger Carmen","Sen A",null,"TSV 1860 Hanau","BV Hanau",22]
["Krüger 15499",100474,15499,"Krüger","Krüger Michael","Sen A",null,"TSV 1860 Hanau","BV Hanau",21]
["Kügler 33080",132582,33080,"Kügler","Kügler Claudia Stephanie","Damen",null,"TSV 1860 Hanau","BV Hanau",22]
["Lassiter 8729",51484,8729,"Lassiter","Lassiter Yasemin","Damen",null,"TSV 1860 Hanau","BV Hanau",22]
["Mautz 8790",88703,8790,"Mautz","Mautz Robert","Sen B",null,"TSV 1860 Hanau","BV Hanau",22]
["Mayer 33109",132419,33109,"Mayer","Mayer Ursula","Sen B",null,"TSV 1860 Hanau","BV Hanau",21]
["Morbe 8836",89099,8836,"Morbe","Morbe Manfred","Sen C",null,"TSV 1860 Hanau","BV Hanau",22]
["Morbe 8838",89100,8838,"Morbe","Morbe Sieglinde","Sen B",null,"TSV 1860 Hanau","BV Hanau",22]
["Morbe 10181",142955,10181,"Morbe","Morbe Wolfgang","Sen C",null,"TSV 1860 Hanau","BV Hanau",22]
["Morbe-Koch 8837",144526,8837,"Morbe-Koch","Morbe-Koch Sandra","Damen",null,"TSV 1860 Hanau","BV Hanau",22]
["Myers 33321",147393,33321,"Myers","Myers Stefan","Herren",null,"TSV 1860 Hanau","BV Hanau",22]
["Nickusch 8889",89101,8889,"Nickusch","Nickusch Michael","Sen B",null,"TSV 1860 Hanau","BV Hanau",22]
["Omer 33113",132467,33113,"Omer","Omer Holger","Sen A",null,"TSV 1860 Hanau","BV Hanau",21]
["Ries 33071",107000,33071,"Ries","Ries Tobias","Herren",null,"TSV 1860 Hanau","BV Hanau",21]
["Scheuermann 15083",27909,15083,"Scheuermann","Scheuermann Sybille","Sen A",null,"TSV 1860 Hanau","BV Hanau",21]
["Schnee 15126",106587,15126,"Schnee","Schnee Florian","Herren",null,"TSV 1860 Hanau","BV Hanau",22]
["Senkbeil 15187",89103,15187,"Senkbeil","Senkbeil Gerhard","Sen C",null,"TSV 1860 Hanau","BV Hanau",20]
["Siebel 10239",149197,10239,"Siebel","Siebel Heidi","Sen B",null,"TSV 1860 Hanau","BV Hanau",22]
["Smith 33104",132414,33104,"Smith","Smith Wyatt","Herren",null,"TSV 1860 Hanau","BV Hanau",22]
["Stephan 15238",89114,15238,"Stephan","Stephan Peter","Sen B",null,"TSV 1860 Hanau","BV Hanau",22]
["Stephan 15842",51900,15842,"Stephan","Stephan Timm","Herren",null,"TSV 1860 Hanau","BV Hanau",22]
["Theis-Franke 15669",27367,15669,"Theis-Franke","Theis-Franke Jörg","Sen B",null,"TSV 1860 Hanau","BV Hanau",22]
["Wenzel 15365",89106,15365,"Wenzel","Wenzel Uwe","Sen A",null,"TSV 1860 Hanau","BV Hanau",22]
["Fischer 15578",242,15578,"Fischer","Fischer Oliver","Herren",null,"BC Höchst","BV Höchst e.V.",21]
["Flassig 8323",66979,8323,"Flassig","Flassig Roland","Sen B",null,"BC Höchst","BV Höchst e.V.",21]
["Hentschel 15475",67601,15475,"Hentschel","Hentschel Klaus Dieter","Sen C",null,"BC Höchst","BV Höchst e.V.",20]
["Janicki 8591",146130,8591,"Janicki","Janicki Silke","Sen A",null,"BC Höchst","BV Höchst e.V.",20]
["Köhler 8674",67602,8674,"Köhler","Köhler Andreas","Sen A",null,"BC Höchst","BV Höchst e.V.",21]
["Linke 15477",146184,15477,"Linke","Linke Nicole","Damen",null,"BC Höchst","BV Höchst e.V.",20]
["Müller 8861",135851,8861,"Müller","Müller Thomas","Sen A",null,"BC Höchst","BV Höchst e.V.",21]
["Schulz 15579",243,15579,"Schulz","Schulz Christian","Herren",null,"BC Höchst","BV Höchst e.V.",21]
["Schulz 15160",88812,15160,"Schulz","Schulz Herbert","Sen C",null,"BC Höchst","BV Höchst e.V.",20]
["Schulz 15163",67604,15163,"Schulz","Schulz Wolfhard","Sen B",null,"BC Höchst","BV Höchst e.V.",20]
["Schwarz 15170",39917,15170,"Schwarz","Schwarz Wolfgang","Sen B",null,"BC Höchst","BV Höchst e.V.",21]
["Siedentopf 15193",67605,15193,"Siedentopf","Siedentopf Peter","Sen C",null,"BC Höchst","BV Höchst e.V.",21]
["Willing 15381",null,15381,"Willing","Willing Helmuth","Sen C",null,"BC Höchst","BV Höchst e.V.",20]
["Zwirnmann 15432",106603,15432,"Zwirnmann","Zwirnmann Rosi","Sen C",null,"BC Höchst","BV Höchst e.V.",20]
["Bartossek 15714",27813,15714,"Bartossek","Bartossek Peter","Sen A",null,"BC Mühlheim","BV Mühlheim",22]
["Berz 15725",27998,15725,"Berz","Berz Wolfgang","Sen B",null,"BC Mühlheim","BV Mühlheim",22]
["Bileci 8103",100749,8103,"Bileci","Bileci Nunzio","Sen B",null,"BC Mühlheim","BV Mühlheim",20]
["Holzwarth 15877",52035,15877,"Holzwarth","Holzwarth Christian","Herren",null,"BC Mühlheim","BV Mühlheim",22]
["Rothenhäuser 15038",100751,15038,"Rothenhäuser","Rothenhäuser Bernd","Sen B",null,"BC Mühlheim","BV Mühlheim",22]
["Rothenhäuser 15039",100752,15039,"Rothenhäuser","Rothenhäuser Werner","Sen A",null,"BC Mühlheim","BV Mühlheim",21]
["Spreng 33009",106797,33009,"Spreng","Spreng Markus","Sen A",null,"BC Mühlheim","BV Mühlheim",22]
["Spreng 33010",106798,33010,"Spreng","Spreng Dominic","Jun",null,"BC Mühlheim","BV Mühlheim",22]
["Glück 15989",106699,15989,"Glück","Glück Andreas","Herren",null,"BC Devils","BV Oberstedtener Devils e.V.",21]
[{"$f":"D514&\" \"&C514","v":"Lambracht 8717"},891,8717,"Lambracht","Lambracht Waltraud","Sen B",null,"BC Devils","BV Oberstedtener Devils e.V.",21]
["Lang 8719",890,8719,"Lang","Lang Christel","Sen A",null,"BC Devils","BV Oberstedtener Devils e.V.",21]
["Möller 8832",40085,8832,"Möller","Möller Beate","Sen B",null,"BC Devils","BV Oberstedtener Devils e.V.",21]
["Ritter 33124",132524,33124,"Ritter","Ritter Marina","Sen B",null,"BC Devils","BV Oberstedtener Devils e.V.",21]
["Ruppel 33184",135954,33184,"Ruppel","Ruppel Heinz-Georg","Sen C",null,"BC Devils","BV Oberstedtener Devils e.V.",21]
["Schomaker 15140",906,15140,"Schomaker","Schomaker Ralf-Thomas","Sen B",null,"BC Devils","BV Oberstedtener Devils e.V.",21]
["Trebbien 15293",909,15293,"Trebbien","Trebbien Uwe","Sen A",null,"BC Devils","BV Oberstedtener Devils e.V.",21]
["Wolf 8255",106937,8255,"Wolf","Wolf Christine","Sen A",null,"BC Devils","BV Oberstedtener Devils e.V.",21]
["Wolf 33034",106936,33034,"Wolf","Wolf Matthias","Sen A",null,"BC Devils","BV Oberstedtener Devils e.V.",21]
["Bien 8093",100533,8093,"Bien","Bien Martin","Sen B",null,"BV Oranje Frankfurt","BV Oranje Frankfurt",20]
["Bien 33154",135823,33154,"Bien","Bien Angelika","Sen C",null,"BV Oranje Frankfurt","BV Oranje Frankfurt",20]
["Gangi-Chiodo 8366",100534,8366,"Gangi-Chiodo","Gangi-Chiodo Francesco","Sen B",null,"BV Oranje Frankfurt","BV Oranje Frankfurt",20]
["Kostial 8690",100535,8690,"Kostial","Kostial Hans-Joachim","Sen C",null,"BV Oranje Frankfurt","BV Oranje Frankfurt",20]
["Thurk 15282",100539,15282,"Thurk","Thurk Rolf","Sen C",null,"BV Oranje Frankfurt","BV Oranje Frankfurt",20]
["Avila 10469",135817,10469,"Avila","Avila Gebbie","Herren",null,"BV Pinoy Frankfurt","BV Pinoy Frankfurt e.V.",20]
["Belgar 8079",144478,8079,"Belgar","Belgar Renato","Sen B",null,"BV Pinoy Frankfurt","BV Pinoy Frankfurt e.V.",21]
["Castaneto 10508",143005,10508,"Castaneto","Castaneto Kurt","Herren",null,"BV Pinoy Frankfurt","BV Pinoy Frankfurt e.V.",20]
["Catibog-Krüger 33244",142994,33244,"Catibog-Krüger","Catibog-Krüger Catherine","Damen",null,"BV Pinoy Frankfurt","BV Pinoy Frankfurt e.V.",21]
["Clark 24949",null,24949,"Clark","Clark Evangeline","Sen C",null,"BV Pinoy Frankfurt","BV Pinoy Frankfurt e.V.",21]
["Extra 10440",132473,10440,"Extra","Extra Dan Oliver","Herren",null,"BV Pinoy Frankfurt","BV Pinoy Frankfurt e.V.",21]
["Hellersberg 15907",67242,15907,"Hellersberg","Hellersberg Dulce","Sen A",null,"BV Pinoy Frankfurt","BV Pinoy Frankfurt e.V.",21]
["Krämer 15768",39642,15768,"Krämer","Krämer Tobias","Herren",null,"BV Pinoy Frankfurt","BV Pinoy Frankfurt e.V.",21]
["Linden 32231",null,32231,"Linden","Linden Marissa","Damen",null,"BV Pinoy Frankfurt","BV Pinoy Frankfurt e.V.",21]
["Manuel 33176",135911,33176,"Manuel","Manuel Arjay","Herren",null,"BV Pinoy Frankfurt","BV Pinoy Frankfurt e.V.",21]
["Mück 33138",132597,33138,"Mück","Mück Michaela","Damen",null,"BV Pinoy Frankfurt","BV Pinoy Frankfurt e.V.",20]
["Naluz 10464",132493,10464,"Naluz","Naluz Allen","Herren",null,"BV Pinoy Frankfurt","BV Pinoy Frankfurt e.V.",20]
["Palma 33245",142993,33245,"Palma","Palma Sigrid Elaine","Damen",null,"BV Pinoy Frankfurt","BV Pinoy Frankfurt e.V.",20]
["Tesoro 10451",135818,10451,"Tesoro","Tesoro Dan Wilfried","Herren",null,"BV Pinoy Frankfurt","BV Pinoy Frankfurt e.V.",21]
["Tilger 33277",null,33277,"Tilger","Tilger Tina","Damen",null,"BV Pinoy Frankfurt","BV Pinoy Frankfurt e.V.",20]
["Verces 32230",null,32230,"Verces","Verces Raquel","Sen A",null,"BV Pinoy Frankfurt","BV Pinoy Frankfurt e.V.",21]
["Walther 30106",120228,30106,"Walther","Walther Heike","Damen",null,"BV Pinoy Frankfurt","BV Pinoy Frankfurt e.V.",21]
["Zeller 33241",142997,33241,"Zeller","Zeller Isabell Marie","Jun",null,"BV Pinoy Frankfurt","BV Pinoy Frankfurt e.V.",21]
["Zeller 33242",142996,33242,"Zeller","Zeller Jörg","Sen A",null,"BV Pinoy Frankfurt","BV Pinoy Frankfurt e.V.",21]
["Zeller 33243",142995,33243,"Zeller","Zeller Patrick","Herren",null,"BV Pinoy Frankfurt","BV Pinoy Frankfurt e.V.",21]
["Armbrüster 8026",100813,8026,"Armbrüster","Armbrüster Alfred","Sen B",null,"BC Rebstock Ffm","BV Rebstock",21]
["Biersack 8097",39534,8097,"Biersack","Biersack Karl","Sen B",null,"BC Rebstock Ffm","BV Rebstock",21]
["Böhne 8124",27276,8124,"Böhne","Böhne Thomas","Sen A",null,"BC Rebstock Ffm","BV Rebstock",21]
["Burger 8168",100814,8168,"Burger","Burger Kurt","Sen B",null,"BC Rebstock Ffm","BV Rebstock",21]
["Flemming 8324",100711,8324,"Flemming","Flemming Claus-Dieter","Sen C",null,"BC Rebstock Ffm","BV Rebstock",21]
["Hartsch 33022",106854,33022,"Hartsch","Hartsch David","Herren",null,"BC Rebstock Ffm","BV Rebstock",21]
["Kumpf 8712",100816,8712,"Kumpf","Kumpf Jürgen","Sen B",null,"BC Rebstock Ffm","BV Rebstock",21]
["Leipnitz 33326",147309,33326,"Leipnitz","Leipnitz Bernd","Sen B",null,"BC Rebstock Ffm","BV Rebstock",21]
["Noss 8897",132530,8897,"Noss","Noss Andreas","Sen B",null,"BC Rebstock Ffm","BV Rebstock",21]
["Ress 15880",52059,15880,"Ress","Ress Andreas","Sen B",null,"BC Rebstock Ffm","BV Rebstock",21]
["Thierfelder 15274",39223,15274,"Thierfelder","Thierfelder Andreas","Sen B",null,"BC Rebstock Ffm","BV Rebstock",20]
["Faull 685",144515,685,"Faull","Faull Roland","Sen A",null,"Queer-Striker","Frankfurter Volleyball Verein e.V.",21]
["Geisler 33261",144516,33261,"Geisler","Geisler Erik","Sen A",null,"Queer-Striker","Frankfurter Volleyball Verein e.V.",20]
["Hohmann 10518",132599,10518,"Hohmann","Hohmann Alexander","Herren",null,"Queer-Striker","Frankfurter Volleyball Verein e.V.",21]
["Hohmann 33143",132600,33143,"Hohmann","Hohmann Uwe","Sen A",null,"Queer-Striker","Frankfurter Volleyball Verein e.V.",21]
["Kaplan 10496",null,10496,"Kaplan","Kaplan Emin","Herren",null,"Queer-Striker","Frankfurter Volleyball Verein e.V.",21]
["Kohler 33146",135803,33146,"Kohler","Kohler William Glenn","Sen C",null,"Queer-Striker","Frankfurter Volleyball Verein e.V.",21]
["König 33117",140104,33117,"König","König Justin","Herren",null,"Queer-Striker","Frankfurter Volleyball Verein e.V.",21]
["Schmitt 33145",135802,33145,"Schmitt","Schmitt Markus","Herren",null,"Queer-Striker","Frankfurter Volleyball Verein e.V.",21]
["Wege 33177",135912,33177,"Wege","Wege Gerhard","Sen B",null,"Queer-Striker","Frankfurter Volleyball Verein e.V.",21]
["Aufschläger 8030",135929,8030,"Aufschläger","Aufschläger Ulrike","Sen A",null,"FSV Frankfurt","FSV Frankfurt",21]
["Fritzjus 15762",39347,15762,"Fritzjus","Fritzjus Jasmin","Damen",null,"FSV Frankfurt","FSV Frankfurt",21]
["Gutzwiller 15158",88634,15158,"Gutzwiller","Gutzwiller Nicole","Damen",null,"FSV Frankfurt","FSV Frankfurt",21]
["Hospe 8568",88631,8568,"Hospe","Hospe Thilo","Sen A",null,"FSV Frankfurt","FSV Frankfurt",21]
["Malow 15127",39914,15127,"Malow","Malow Christine","Damen",null,"FSV Frankfurt","FSV Frankfurt",21]
["Paparaphiou 8924",88633,8924,"Paparaphiou","Paparaphiou Jessica","Damen",null,"FSV Frankfurt","FSV Frankfurt",21]
["Schmidt 8110",27438,8110,"Schmidt","Schmidt Julia","Damen",null,"FSV Frankfurt","FSV Frankfurt",21]
["Spendler 15208",51637,15208,"Spendler","Spendler Peggy","Sen A",null,"FSV Frankfurt","FSV Frankfurt",21]
["Thomas 15278",88635,15278,"Thomas","Thomas Hans-Jürgen","Sen B",null,"FSV Frankfurt","FSV Frankfurt",21]
["Adjei 15947",99874,15947,"Adjei","Adjei Danilo","Herren",null,"FTG-BC Frankfurt","FTG 1847 Frankfurt",22]
[{"$f":"D578&\" \"&C578","v":"Ammer 8018"},88780,8018,"Ammer","Ammer Frank","Sen C",null,"FTG-BC Frankfurt","FTG 1847 Frankfurt",22]
["Bott 15823",51453,15823,"Bott","Bott Inge","Sen B",null,"FTG-BC Frankfurt","FTG 1847 Frankfurt",22]
["Eylardi 8279",88781,8279,"Eylardi","Eylardi Michaela","Sen B",null,"FTG-BC Frankfurt","FTG 1847 Frankfurt",22]
["Fastus 15962",100568,15962,"Fastus","Fastus Lars","Jun",null,"FTG-BC Frankfurt","FTG 1847 Frankfurt",22]
["Gabel 1447",56701,1447,"Gabel","Gabel Janine-Manuela","Damen",null,"FTG-BC Frankfurt","FTG 1847 Frankfurt",22]
["Geißler 14633",26106,14633,"Geißler","Geißler Nadine","Damen",null,"FTG-BC Frankfurt","FTG 1847 Frankfurt",21]
["Heine 10688",147301,10688,"Heine","Heine Janine Leonie","Jun",null,"FTG-BC Frankfurt","FTG 1847 Frankfurt",21]
["Heine 8487",106595,8487,"Heine","Heine Klaudija","Sen A",null,"FTG-BC Frankfurt","FTG 1847 Frankfurt",21]
["Heinrich 8488",39776,8488,"Heinrich","Heinrich Thorsten","Sen A",null,"FTG-BC Frankfurt","FTG 1847 Frankfurt",20]
["Helfrich 8494",51454,8494,"Helfrich","Helfrich Regina","Sen A",null,"FTG-BC Frankfurt","FTG 1847 Frankfurt",22]
["Helfrich 33075",107024,33075,"Helfrich","Helfrich Rainer","Sen A",null,"FTG-BC Frankfurt","FTG 1847 Frankfurt",22]
["Heuckeroth 15810",51233,15810,"Heuckeroth","Heuckeroth Anna","Damen",null,"FTG-BC Frankfurt","FTG 1847 Frankfurt",22]
["Kaiser 966",69480,966,"Kaiser","Kaiser Gerd","Herren",null,"FTG-BC Frankfurt","FTG 1847 Frankfurt",20]
["Keitel 33328",149133,33328,"Keitel","Keitel Beate","Jug A",null,"FTG-BC Frankfurt","FTG 1847 Frankfurt",22]
["Löschnig 15764",null,15764,"Löschnig","Löschnig Stephan","Herren",null,"FTG-BC Frankfurt","FTG 1847 Frankfurt",21]
["Löw 33019",106848,33019,"Löw","Löw Maximilian","Herren",null,"FTG-BC Frankfurt","FTG 1847 Frankfurt",21]
["Mader 15754",40056,15754,"Mader","Mader Chantal","Damen",null,"FTG-BC Frankfurt","FTG 1847 Frankfurt",22]
["Meurer 8805",40096,8805,"Meurer","Meurer Sylvia","Sen B",null,"FTG-BC Frankfurt","FTG 1847 Frankfurt",22]
["Michajlow 12495",149953,12495,"Michajlow","Michajlow Adile","Damen",null,"FTG-BC Frankfurt","FTG 1847 Frankfurt",22]
["Pietzsch 15824",51617,15824,"Pietzsch","Pietzsch Frank","Sen A",null,"FTG-BC Frankfurt","FTG 1847 Frankfurt",21]
["Preis 33332",149147,33332,"Preis","Preis Alina","Jug A",null,"FTG-BC Frankfurt","FTG 1847 Frankfurt",21]
["Preis 33231",140138,33231,"Preis","Preis Alexander","Sen A",null,"FTG-BC Frankfurt","FTG 1847 Frankfurt",22]
["Roth 33276",146049,33276,"Roth","Roth Sebastian","Jun",null,"FTG-BC Frankfurt","FTG 1847 Frankfurt",22]
["Sand 33335",149855,33335,"Sand","Sand Christopher","Herren",null,"FTG-BC Frankfurt","FTG 1847 Frankfurt",22]
["Schrank 15251",27325,15251,"Schrank","Schrank Nicole","Damen",null,"FTG-BC Frankfurt","FTG 1847 Frankfurt",22]
["Schütz 26117",40304,26117,"Schütz","Schütz Ulrike","Sen B",null,"FTG-BC Frankfurt","FTG 1847 Frankfurt",22]
["Schwimmer 33131",132547,33131,"Schwimmer","Schwimmer Patrick","Herren",null,"FTG-BC Frankfurt","FTG 1847 Frankfurt",22]
["Seitz 33134",132578,33134,"Seitz","Seitz Dieter","Sen A",null,"FTG-BC Frankfurt","FTG 1847 Frankfurt",22]
["Seitz 33181",135940,33181,"Seitz","Seitz Maximilian","Jun",null,"FTG-BC Frankfurt","FTG 1847 Frankfurt",21]
["Stapper 15976",106574,15976,"Stapper","Stapper Tim","Jun",null,"FTG-BC Frankfurt","FTG 1847 Frankfurt",22]
["Stapper 33333",149245,33333,"Stapper","Stapper Finja","Jug A",null,"FTG-BC Frankfurt","FTG 1847 Frankfurt",21]
["Tharra 15270",39671,15270,"Tharra","Tharra Marina","Sen B",null,"FTG-BC Frankfurt","FTG 1847 Frankfurt",22]
["Then 15272",106624,15272,"Then","Then Manuela","Sen A",null,"FTG-BC Frankfurt","FTG 1847 Frankfurt",22]
["Then 15273",548,15273,"Then","Then Oliver","Sen A",null,"FTG-BC Frankfurt","FTG 1847 Frankfurt",22]
["Timter 15284",39644,15284,"Timter","Timter Vanessa","Damen",null,"FTG-BC Frankfurt","FTG 1847 Frankfurt",22]
["Tross 33323",147302,33323,"Tross","Tross Marissa","Sen A",null,"FTG-BC Frankfurt","FTG 1847 Frankfurt",22]
["Tross 33162",135854,33162,"Tross","Tross Shannon Renee","Jug A",null,"FTG-BC Frankfurt","FTG 1847 Frankfurt",20]
["Aljakrinskij 10065",107111,10065,"Aljakrinskij","Aljakrinskij Alexander","Sen B",null,"BC 83 Kelsterbach","KBV Kelsterbach",20]
["Aurami 33292",147209,33292,"Aurami","Aurami Christina","Jug A",null,"BC 83 Kelsterbach","KBV Kelsterbach",20]
["Beyertt 33331",149144,33331,"Beyertt","Beyertt Mike","Jun",null,"BC 83 Kelsterbach","KBV Kelsterbach",21]
["Cabrera Tudela 8176",106539,8176,"Cabrera Tudela","Cabrera Tudela Antonio","Sen C",null,"BC 83 Kelsterbach","KBV Kelsterbach",21]
["Chalkidis 8190",549,8190,"Chalkidis","Chalkidis Anastasios","Sen A",null,"BC 83 Kelsterbach","KBV Kelsterbach",21]
["Cussler 15784",39634,15784,"Cussler","Cussler Karl","Sen C",null,"BC 83 Kelsterbach","KBV Kelsterbach",21]
["Da Silva Gomes 33255",143040,33255,"Da Silva Gomes","Da Silva Gomes Joel","Jug B",null,"BC 83 Kelsterbach","KBV Kelsterbach",21]
["Da Silva Gomes 33293",147210,33293,"Da Silva Gomes","Da Silva Gomes Patricia","Jun",null,"BC 83 Kelsterbach","KBV Kelsterbach",21]
["Denbrock 33337",149921,33337,"Denbrock","Denbrock Stephen","Herren",null,"BC 83 Kelsterbach","KBV Kelsterbach",21]
["Derleth 33067",106996,33067,"Derleth","Derleth Michael","Herren",null,"BC 83 Kelsterbach","KBV Kelsterbach",21]
["Desiderio 8225",27698,8225,"Desiderio","Desiderio Giovanni","Sen B",null,"BC 83 Kelsterbach","KBV Kelsterbach",21]
["Doffin 33061",106989,33061,"Doffin","Doffin Rebecca","Damen",null,"BC 83 Kelsterbach","KBV Kelsterbach",21]
["Drabe 15709",27701,15709,"Drabe","Drabe Sven","Herren",null,"BC 83 Kelsterbach","KBV Kelsterbach",21]
["Engisch 8276",106540,8276,"Engisch","Engisch Erhard","Sen C",null,"BC 83 Kelsterbach","KBV Kelsterbach",21]
["Figueiredo Mendes 33297",147217,33297,"Figueiredo Mendes","Figueiredo Mendes Kevin","Jun",null,"BC 83 Kelsterbach","KBV Kelsterbach",20]
["Fleischhacker 15935",67549,15935,"Fleischhacker","Fleischhacker Michael","Herren",null,"BC 83 Kelsterbach","KBV Kelsterbach",21]
["Ginting 8393",147207,8393,"Ginting","Ginting Bangun","Sen A",null,"BC 83 Kelsterbach","KBV Kelsterbach",21]
["Held 8490",106542,8490,"Held","Held Ernst","Sen C",null,"BC 83 Kelsterbach","KBV Kelsterbach",21]
["Hilger 8539",106544,8539,"Hilger","Hilger Detlef","Sen A",null,"BC 83 Kelsterbach","KBV Kelsterbach",21]
["Hochhaus 15885",66767,15885,"Hochhaus","Hochhaus Jonny","Sen A",null,"BC 83 Kelsterbach","KBV Kelsterbach",21]
["Hochhaus 15891",67273,15891,"Hochhaus","Hochhaus Jan","Herren",null,"BC 83 Kelsterbach","KBV Kelsterbach",21]
["Hochhaus 15937",67660,15937,"Hochhaus","Hochhaus Barbara","Sen A",null,"BC 83 Kelsterbach","KBV Kelsterbach",21]
["Höhn 33153",135822,33153,"Höhn","Höhn Sascha","Herren",null,"BC 83 Kelsterbach","KBV Kelsterbach",21]
["Hormann 8561",140051,8561,"Hormann","Hormann Bettina","Damen",null,"BC 83 Kelsterbach","KBV Kelsterbach",21]
["Jourdan 33032",106926,33032,"Jourdan","Jourdan Frank","Sen A",null,"BC 83 Kelsterbach","KBV Kelsterbach",21]
["Knobloch 10069",27702,10069,"Knobloch","Knobloch Joerg","Herren",null,"BC 83 Kelsterbach","KBV Kelsterbach",21]
["Kourou 33315",147377,33315,"Kourou","Kourou Kevser","Jug B",null,"BC 83 Kelsterbach","KBV Kelsterbach",20]
[{"$f":"D642&\" \"&C642","v":"Kvocka 33256"},143041,33256,"Kvocka","Kvocka Jannik","Jug B",null,"BC 83 Kelsterbach","KBV Kelsterbach",21]
["Lebkücher 26651",127817,26651,"Lebkücher","Lebkücher Christian","Herren",null,"BC 83 Kelsterbach","KBV Kelsterbach",21]
["Lella 33048",106968,33048,"Lella","Lella Michele Antonio","Herren",null,"BC 83 Kelsterbach","KBV Kelsterbach",21]
["Lopez Rodrigues 8755",106545,8755,"Lopez Rodrigues","Lopez Rodrigues Raul","Sen C",null,"BC 83 Kelsterbach","KBV Kelsterbach",21]
["Lopez y Zuvita 10604",140142,10604,"Lopez y Zuvita","Lopez y Zuvita David","Herren",null,"BC 83 Kelsterbach","KBV Kelsterbach",21]
["Machura 15782",39635,15782,"Machura","Machura Sandra","Damen",null,"BC 83 Kelsterbach","KBV Kelsterbach",21]
["Machura 15783",39637,15783,"Machura","Machura Damian","Herren",null,"BC 83 Kelsterbach","KBV Kelsterbach",21]
["Mank 8778",88694,8778,"Mank","Mank Siegfried","Sen B",null,"BC 83 Kelsterbach","KBV Kelsterbach",21]
["Nguyen 33233",140140,33233,"Nguyen","Nguyen Boris","Jun",null,"BC 83 Kelsterbach","KBV Kelsterbach",21]
["Rejzek 33330",149143,33330,"Rejzek","Rejzek Manuel","Jug B",null,"BC 83 Kelsterbach","KBV Kelsterbach",21]
["Rejzek 15929",67508,15929,"Rejzek","Rejzek Alexander","Jun",null,"BC 83 Kelsterbach","KBV Kelsterbach",21]
["Rossel 15037",106546,15037,"Rossel","Rossel Reiner","Sen C",null,"BC 83 Kelsterbach","KBV Kelsterbach",21]
["Schmitt 15120",106550,15120,"Schmitt","Schmitt Hans-Werner","Sen B",null,"BC 83 Kelsterbach","KBV Kelsterbach",21]
["Serat 33291",147208,33291,"Serat","Serat Sasilak","Jug A",null,"BC 83 Kelsterbach","KBV Kelsterbach",21]
["Spot 15213",106551,15213,"Spot","Spot Heinz","Sen B",null,"BC 83 Kelsterbach","KBV Kelsterbach",21]
["Suchy 33110",132424,33110,"Suchy","Suchy Nikolai","Sen A",null,"BC 83 Kelsterbach","KBV Kelsterbach",20]
["Thorun 33232",140139,33232,"Thorun","Thorun Connie Wai Fan","Damen",null,"BC 83 Kelsterbach","KBV Kelsterbach",21]
["Umbach 10667",147351,10667,"Umbach","Umbach Armin","Sen B",null,"BC 83 Kelsterbach","KBV Kelsterbach",21]
["Umbach 33229",140128,33229,"Umbach","Umbach Christian","Herren",null,"BC 83 Kelsterbach","KBV Kelsterbach",21]
["Vogt 15699",27785,15699,"Vogt","Vogt Matthias","Sen A",null,"BC 83 Kelsterbach","KBV Kelsterbach",21]
["Vogt 33152",135820,33152,"Vogt","Vogt Kitiyalath","Damen",null,"BC 83 Kelsterbach","KBV Kelsterbach",21]
["Weidinger 33130",132546,33130,"Weidinger","Weidinger Siegbert","Sen B",null,"BC 83 Kelsterbach","KBV Kelsterbach",21]
["Winkelmann 33096",107137,33096,"Winkelmann","Winkelmann Marco","Herren",null,"BC 83 Kelsterbach","KBV Kelsterbach",21]
["Winkelmann 33136",132586,33136,"Winkelmann","Winkelmann Nick","Jun",null,"BC 83 Kelsterbach","KBV Kelsterbach",21]
["Zwegerl 33135",132585,33135,"Zwegerl","Zwegerl Andreas","Herren",null,"BC 83 Kelsterbach","KBV Kelsterbach",21]
["Albert 8013",67165,8013,"Albert","Albert Stefan","Sen A",null,"Mainhattan Bowlers Frankfurt","Mainhattan Bowlers Frankfurt",21]
["Baier 8037",39866,8037,"Baier","Baier Michael","Sen B",null,"Mainhattan Bowlers Frankfurt","Mainhattan Bowlers Frankfurt",21]
["Barth 8044",88627,8044,"Barth","Barth Dietmar","Sen B",null,"Mainhattan Bowlers Frankfurt","Mainhattan Bowlers Frankfurt",21]
["Becker 33178",33178,33178,"Becker","Becker Nils","Jun",null,"Mainhattan Bowlers Frankfurt","Mainhattan Bowlers Frankfurt",20]
["Diekmann 33265",144531,33265,"Diekmann","Diekmann Sandra","Damen",null,"Mainhattan Bowlers Frankfurt","Mainhattan Bowlers Frankfurt",21]
["Gertenbach 15827",51483,15827,"Gertenbach","Gertenbach Sabine","Sen C",null,"Mainhattan Bowlers Frankfurt","Mainhattan Bowlers Frankfurt",21]
["Greenaway 15647",27172,15647,"Greenaway","Greenaway Jesse","Sen B",null,"Mainhattan Bowlers Frankfurt","Mainhattan Bowlers Frankfurt",21]
["Grieb 15958",100558,15958,"Grieb","Grieb Waldemar","Sen B",null,"Mainhattan Bowlers Frankfurt","Mainhattan Bowlers Frankfurt",20]
["Hack 8441",89407,8441,"Hack","Hack Dietmar","Sen C",null,"Mainhattan Bowlers Frankfurt","Mainhattan Bowlers Frankfurt",21]
["Herbig 10243",100343,10243,"Herbig","Herbig Frank","Sen A",null,"Mainhattan Bowlers Frankfurt","Mainhattan Bowlers Frankfurt",20]
["Heßler 15740",144499,15740,"Heßler","Heßler Patrick","Herren",null,"Mainhattan Bowlers Frankfurt","Mainhattan Bowlers Frankfurt",20]
["Hlavinka 8546",100129,8546,"Hlavinka","Hlavinka Pascal","Herren",null,"Mainhattan Bowlers Frankfurt","Mainhattan Bowlers Frankfurt",21]
["Hoyle 8569",null,8569,"Hoyle","Hoyle Keith","Sen B",null,"Mainhattan Bowlers Frankfurt","Mainhattan Bowlers Frankfurt",21]
["Ihrig 33324",147303,33324,"Ihrig","Ihrig Petra","Sen A",null,"Mainhattan Bowlers Frankfurt","Mainhattan Bowlers Frankfurt",20]
["Jantschik 33015",106832,33015,"Jantschik","Jantschik Leonhard","Sen B",null,"Mainhattan Bowlers Frankfurt","Mainhattan Bowlers Frankfurt",20]
["Kaiser 8618",88701,8618,"Kaiser","Kaiser Michael","Sen A",null,"Mainhattan Bowlers Frankfurt","Mainhattan Bowlers Frankfurt",21]
["Kaiser 33070",106998,33070,"Kaiser","Kaiser Dominik","Herren",null,"Mainhattan Bowlers Frankfurt","Mainhattan Bowlers Frankfurt",20]
["Lassiter 8728",51486,8728,"Lassiter","Lassiter Wayne","Sen B",null,"Mainhattan Bowlers Frankfurt","Mainhattan Bowlers Frankfurt",20]
["Meß 14604",null,14604,"Meß","Meß Manfred","Sen B",null,"Mainhattan Bowlers Frankfurt","Mainhattan Bowlers Frankfurt",21]
["Micianova 8814",144463,8814,"Micianova","Micianova Jana","Damen",null,"Mainhattan Bowlers Frankfurt","Mainhattan Bowlers Frankfurt",21]
["Opfer 14076",null,14076,"Opfer","Opfer Manfred","Sen A",null,"Mainhattan Bowlers Frankfurt","Mainhattan Bowlers Frankfurt",20]
["Pilo 8949",532,8949,"Pilo","Pilo Salvatore","Sen B",null,"Mainhattan Bowlers Frankfurt","Mainhattan Bowlers Frankfurt",21]
["Pistara 33214",140070,33214,"Pistara","Pistara Marco","Herren",null,"Mainhattan Bowlers Frankfurt","Mainhattan Bowlers Frankfurt",21]
["Reuter 33266",144464,33266,"Reuter","Reuter Sascha","Herren",null,"Mainhattan Bowlers Frankfurt","Mainhattan Bowlers Frankfurt",20]
["Reuter 15013",67611,15013,"Reuter","Reuter Winfried","Sen C",null,"Mainhattan Bowlers Frankfurt","Mainhattan Bowlers Frankfurt",20]
["Riedel 10491",null,10491,"Riedel","Riedel Angelika","Sen C",null,"Mainhattan Bowlers Frankfurt","Mainhattan Bowlers Frankfurt",21]
["Rott 15598",954,15598,"Rott","Rott Waltraud","Sen B",null,"Mainhattan Bowlers Frankfurt","Mainhattan Bowlers Frankfurt",21]
["Rüffer 33193",135979,33193,"Rüffer","Rüffer Andreas","Sen A",null,"Mainhattan Bowlers Frankfurt","Mainhattan Bowlers Frankfurt",20]
["Schäfer 15065",51533,15065,"Schäfer","Schäfer Jürgen","Sen A",null,"Mainhattan Bowlers Frankfurt","Mainhattan Bowlers Frankfurt",21]
["Schlösser 15440",100132,15440,"Schlösser","Schlösser Patrick","Herren",null,"Mainhattan Bowlers Frankfurt","Mainhattan Bowlers Frankfurt",21]
["Seemann 15575",307,15575,"Seemann","Seemann Thomas","Sen A",null,"Mainhattan Bowlers Frankfurt","Mainhattan Bowlers Frankfurt",20]
["Simon 33322",147396,33322,"Simon","Simon Dirk","Herren",null,"Mainhattan Bowlers Frankfurt","Mainhattan Bowlers Frankfurt",20]
["Tambosi 15943",89301,15943,"Tambosi","Tambosi Michael","Sen B",null,"Mainhattan Bowlers Frankfurt","Mainhattan Bowlers Frankfurt",21]
["Tanhaei-Bazkiaei 15454",27369,15454,"Tanhaei-Bazkiaei","Tanhaei-Bazkiaei Djamshid","Sen A",null,"Mainhattan Bowlers Frankfurt","Mainhattan Bowlers Frankfurt",20]
["Unger 15310",88559,15310,"Unger","Unger Bernd","Sen C",null,"Mainhattan Bowlers Frankfurt","Mainhattan Bowlers Frankfurt",20]
[null,147304,33325,"Weigel","Weigel Harald","Sen A",null,"Mainhattan Bowlers Frankfurt","Mainhattan Bowlers Frankfurt",21]
[null,135994,33195,"Bämpfer","Bämpfer Gerald","Sen A",null,"Blau-Gelb Fulda Strikers","PSV BG Fulda 1934/61 e.V.",22]
[null,143032,33251,"Belletz","Belletz Antonia","Damen",null,"Blau-Gelb Fulda Strikers","PSV BG Fulda 1934/61 e.V.",22]
[null,146161,33284,"Blaye","Blaye Stephen","Herren",null,"Blau-Gelb Fulda Strikers","PSV BG Fulda 1934/61 e.V.",21]
[null,135985,33203,"De Fries","De Fries Frank","Sen A",null,"Blau-Gelb Fulda Strikers","PSV BG Fulda 1934/61 e.V.",22]
[null,135988,33200,"Decher","Decher Carsten","Herren",null,"Blau-Gelb Fulda Strikers","PSV BG Fulda 1934/61 e.V.",22]
[null,146193,33288,"Duringer","Duringer Karin","Sen A",null,"Blau-Gelb Fulda Strikers","PSV BG Fulda 1934/61 e.V.",22]
[null,143030,8290,"Fehl","Fehl Manuel","Herren",null,"Blau-Gelb Fulda Strikers","PSV BG Fulda 1934/61 e.V.",22]
[null,146191,33286,"Garcia","Garcia Eduardo","Herren",null,"Blau-Gelb Fulda Strikers","PSV BG Fulda 1934/61 e.V.",20]
[null,135982,33206,"Geis","Geis Dominik","Herren",null,"Blau-Gelb Fulda Strikers","PSV BG Fulda 1934/61 e.V.",22]
[null,144500,8407,"Gonschorek","Gonschorek Bernd","Sen A",null,"Blau-Gelb Fulda Strikers","PSV BG Fulda 1934/61 e.V.",20]
[null,143031,33250,"Heil","Heil Sven","Herren",null,"Blau-Gelb Fulda Strikers","PSV BG Fulda 1934/61 e.V.",22]
[null,143029,33249,"Heun","Heun Susan","Damen",null,"Blau-Gelb Fulda Strikers","PSV BG Fulda 1934/61 e.V.",22]
[null,135981,33207,"Hofmann","Hofmann Maximilian","Herren",null,"Blau-Gelb Fulda Strikers","PSV BG Fulda 1934/61 e.V.",21]
[null,146190,33285,"Ihm","Ihm Julian","Herren",null,"Blau-Gelb Fulda Strikers","PSV BG Fulda 1934/61 e.V.",20]
[null,135901,33173,"Kaiser","Kaiser Oliver","Sen A",null,"Blau-Gelb Fulda Strikers","PSV BG Fulda 1934/61 e.V.",21]
[null,135900,33174,"Kaiser","Kaiser Petra","Sen A",null,"Blau-Gelb Fulda Strikers","PSV BG Fulda 1934/61 e.V.",21]
[null,143033,33252,"Kochanski","Kochanski Louisa","Damen",null,"Blau-Gelb Fulda Strikers","PSV BG Fulda 1934/61 e.V.",21]
[null,135993,33196,"Krönung","Krönung Peter","Sen A",null,"Blau-Gelb Fulda Strikers","PSV BG Fulda 1934/61 e.V.",22]
[null,146192,33287,"Lega","Lega Rene","Herren",null,"Blau-Gelb Fulda Strikers","PSV BG Fulda 1934/61 e.V.",21]
[null,135986,33202,"Oezkan","Oezkan Kaan","Herren",null,"Blau-Gelb Fulda Strikers","PSV BG Fulda 1934/61 e.V.",22]
[null,140126,33226,"Otterbein","Otterbein Jens","Herren",null,"Blau-Gelb Fulda Strikers","PSV BG Fulda 1934/61 e.V.",22]
[null,140124,33227,"Otterbein","Otterbein Sandra","Damen",null,"Blau-Gelb Fulda Strikers","PSV BG Fulda 1934/61 e.V.",22]
[null,140125,33228,"Otterbein","Otterbein Andre","Herren",null,"Blau-Gelb Fulda Strikers","PSV BG Fulda 1934/61 e.V.",22]
[null,135987,33201,"Philipp","Philipp Thomas","Sen A",null,"Blau-Gelb Fulda Strikers","PSV BG Fulda 1934/61 e.V.",22]
[null,135998,33209,"Pronk","Pronk Antares","Herren",null,"Blau-Gelb Fulda Strikers","PSV BG Fulda 1934/61 e.V.",22]
[null,146194,33289,"Schmitt","Schmitt Markus","Sen A",null,"Blau-Gelb Fulda Strikers","PSV BG Fulda 1934/61 e.V.",22]
[null,135989,15124,"Schmitt","Schmitt Wolfgang","Sen A",null,"Blau-Gelb Fulda Strikers","PSV BG Fulda 1934/61 e.V.",21]
[null,135984,33204,"Schröter","Schröter Melanie","Damen",null,"Blau-Gelb Fulda Strikers","PSV BG Fulda 1934/61 e.V.",22]
[null,135992,33197,"Seuring","Seuring Harald","Sen A",null,"Blau-Gelb Fulda Strikers","PSV BG Fulda 1934/61 e.V.",22]
[null,135991,33198,"Traber","Traber Sandro","Sen A",null,"Blau-Gelb Fulda Strikers","PSV BG Fulda 1934/61 e.V.",22]
[null,135990,33199,"Traber","Traber Anita","Sen B",null,"Blau-Gelb Fulda Strikers","PSV BG Fulda 1934/61 e.V.",22]
[null,147392,33320,"Zaczyk","Zaczyk Dustin","Jun",null,"Blau-Gelb Fulda Strikers","PSV BG Fulda 1934/61 e.V.",22]
[null,135995,33194,"Zehentmaier","Zehentmaier Lucas","Herren",null,"Blau-Gelb Fulda Strikers","PSV BG Fulda 1934/61 e.V.",21]
[null,135983,33205,"Zimmermann","Zimmermann Daniel","Herren",null,"Blau-Gelb Fulda Strikers","PSV BG Fulda 1934/61 e.V.",22]
[null,135843,33160,"Blecher","Blecher Lucas","Jun",null,"SW Friedberg","Schwarz Weiss Friedberg",22]
[null,135971,33186,"Blecher","Blecher Anika","Damen",null,"SW Friedberg","Schwarz Weiss Friedberg",22]
[null,106925,33031,"Bugs","Bugs Sven","Herren",null,"SW Friedberg","Schwarz Weiss Friedberg",20]
[null,67019,8173,"Buskowiak","Buskowiak Thomas","Sen B",null,"SW Friedberg","Schwarz Weiss Friedberg",22]
[null,149130,10404,"Ehrlich","Ehrlich Oliver","Sen A",null,"SW Friedberg","Schwarz Weiss Friedberg",21]
[null,147382,33317,"Fuhr","Fuhr Liam","Jun",null,"SW Friedberg","Schwarz Weiss Friedberg",22]
[null,67441,8451,"Hahn","Hahn Dietmar","Sen B",null,"SW Friedberg","Schwarz Weiss Friedberg",22]
[null,52056,15881,"Hassenpflug","Hassenpflug Marcel","Herren",null,"SW Friedberg","Schwarz Weiss Friedberg",22]
[null,147242,10416,"Hess","Hess Hubert","Sen A",null,"SW Friedberg","Schwarz Weiss Friedberg",22]
[null,147241,33311,"Hess","Hess Elke","Sen A",null,"SW Friedberg","Schwarz Weiss Friedberg",22]
[null,140057,33210,"Hoffmann","Hoffmann Rene","Herren",null,"SW Friedberg","Schwarz Weiss Friedberg",20]
[null,899,15608,"Merkel","Merkel Ralf","Sen A",null,"SW Friedberg","Schwarz Weiss Friedberg",22]
[null,135838,33158,"Michael","Michael Alexander","Herren",null,"SW Friedberg","Schwarz Weiss Friedberg",20]
[null,147308,10438,"Pötzl","Pötzl Stefan","Sen A",null,"SW Friedberg","Schwarz Weiss Friedberg",21]
[null,106915,33029,"Rothenbacher","Rothenbacher Ralph","Sen B",null,"SW Friedberg","Schwarz Weiss Friedberg",21]
[null,147243,10112,"Schlier","Schlier Uwe","Sen B",null,"SW Friedberg","Schwarz Weiss Friedberg",22]
[null,52057,10111,"Schlier","Schlier Elisabeth","Sen B",null,"SW Friedberg","Schwarz Weiss Friedberg",22]
[null,146153,33282,"Schmidt","Schmidt Thomas","Sen B",null,"SW Friedberg","Schwarz Weiss Friedberg",22]
[null,67511,15297,"Trendel","Trendel Richard","Sen B",null,"SW Friedberg","Schwarz Weiss Friedberg",22]
[null,106750,15996,"Trendel","Trendel Marvin","Herren",null,"SW Friedberg","Schwarz Weiss Friedberg",22]
[null,67512,15337,"Walter","Walter Gerhard","Sen B",null,"SW Friedberg","Schwarz Weiss Friedberg",22]
[null,135970,33185,"Wien","Wien Stefan","Sen A",null,"SW Friedberg","Schwarz Weiss Friedberg",22]
[null,146042,33275,"Wollmann","Wollmann Martin","Herren",null,"SW Friedberg","S+T4:AA761chwarz Weiss Friedberg",22]
[]
[]
[]
[]
[]
[]
[]
[]
[]
[]
[]
[]
[]
[]
[]
[]
[]
[]
[]
[]
[]
[]
[]
[]
[]
[]
[]
[]
[]
[]
[]
[]
[]
[]
[]
[]
[]
[]
[]
[]
[]
[]
[]
[]
[]
[]
[]
[]
[]
[]
[]
[]
[]
[]
[]
[]
[]
[]
[]
[]
[]
[]
[]
[]
[]
[]
[]
[]
[]
[]
[]
[]
[]
[]
[]
[]
[]
[]
[]
[]
[]
[]
[]
[]
[]
[]
[]
[]
[]
[]
[]
[]
[]
[]
[]
[]
[]
[]
[]
[]
[]
[]
[]
[]
[]
[]
[]
[]
[]
[]
[]
[]
[]
[]
[]
[]
[]
[]
[]
[]
[]
[]
[]
[]
[]
[]
[]
[]
[]
[]
[]
[]
[]
[]
[]
[]
[]
[]
[]
[]
[]
[]
[]
[]
[]
[]
[]
[]
[]
[]
[]
[]
[]
[]
[]
[{"$f":"D915&\" \"&C915","v":" "}]
[]
[]
[]
[]
[]
[]
[]
[]
[]
[]
[{"$f":"D926&\" \"&C926","v":" "}]
[{"$f":"D927&\" \"&C927","v":" "}]
[]
[]
[]
[]
[]
[]
[]
[]
[]
[]
[]
[]
[]
[]
[]
[]
[]
[]
[]
[]
[]
[]
[]
[]
[]
[]
[]
[]
[]
[]
[]
[]
[]
[]
[]
[]
[]
[]
[]
[]
[]
[]
[]
[]
[]
[]
[]
[]
[]
[]
[]
[]
[{"$f":"D980&\" \"&C980","v":" "}]
[]
[]
[]
[]
[]
[]
[]
[]
[]
[]
[]
[]
[]
[]
[]
[]
[]
[]
[]
[]
[]
[]
[]
[]
[]
[]
[]
[]
[]
[]
[]
[]
[]
[]
[]
[]
[]
[]
[]
[]
[]
[]
[]
[]
[]
[]
[]
[]
[]
[]
[]
[]
[{"$f":"D1033&\" \"&C1033","v":" "}]
[]
[]
[]
[]
[]
[]
[]
[]
[]
[]
[]
[]
[]
[]
[]
[]
[]
[]
[]
[]
[]
[]
[]
[]
[]
[]
[]
[]
[]
[]
[]
[]
[]
[]
[]
[]
[]
[]
[]
[]
[]
[]
[]
[]
[]
[]
[]
[]
[]
[]
[]
[]
[]
[]
[]
[]
[]
[]
[]
[]
[]
[]
[]
[]
[{"$f":"D1098&\" \"&C1098","v":" "}]
[]
[]
[]
[]
[]
[]
[]
[]
[]
[]
[]
[]
[]
[]
[]
[]
[]
[]
[{"$f":"D1117&\" \"&C1117","v":" "}]
[]
[]
[]
[]
[]
[]
[]
[]
[]
[]
[]
[]
[]
[]
[]
[]
[]
[]
[]
[]
[]
[]
[]
[]
[]
[]
[]
[]
[]
[]
[]
[]
[]
[]
[]
[]
[]
[]
[]
[]
[]
[]
[]
[]
[]
[]
[]
[]
[]
[]
[]
[]
[]
[]
[]
[]
[]
[]
[]
[]
[]
[{"$f":"D1179&\" \"&C1179","v":" "}]
[]
[]
[]
[]
[]
[]
[]
[]
[]
[]
[]
[]
[]
[]
[]
[]
[]
[]
[]
[]
[]
[]
[]
[]
[]
[]
[]
[]
[]
[]
[]
[]
[]
[]
[]
[]
[]
[]
[]
[]
[]
[]
[]
[]
[]
[]
[]
[]
[]
[]
[]
[]
[]
[]
[]
[]
[]
[]
[]
[]
[]
[]
[]
[]
[]
[]
[{"$f":"D1246&\" \"&C1246","v":" "}]
[]
[]
[]
[]
[]
[]
[]
[]
[]
[]
[]
[]
[]
[]
[]
[]
[]
[]
[]
[]
[]
[]
[]
[]
[]
[]
[]
[]
[]
[]
[]
[]
[]
[]
[]
[]
[]
[]
[]
[]
[]
[]
[]
[]
[]
[]
[]
[]
[]
[]
[]
[]
[]
[]
[{"$f":"D1301&\" \"&C1301","v":" "}]
[]
[]
[]
[]
[]
[]
[]
[]
[]
[]
[]
[]
[]
[]
[]
[]
[]
[]
[]
[]
[]
[]
[]
[]
[]
[]
[]
[]
[]
[]
[]
[]
[]
[]
[]
[]
[]
[]
[]
[]
[]
[]
[]
[]
[]
[]
[]
[]
[]
[]
[]
[]
[]
[]
[]
[]
[]
[]
[]
[]
[]
[]
[]
[]
[]
[]
[]
[]
[]
[]
[]
[]
[]
[]
[]
[]
[]
[]
[]
[]
[]
[]
[]
[]
[]
[]
[]
[]
[]
[]
[]
[]
[]
[]
[]
[]
[]
[]
[]
[]
[]
[]
[]
[]
[]
[]
[]
[]
[]
[]
[]
[]
[]
[]
[]
[]
[]
[]
[]
[]
[]
[]
[]
[]
[]
[]
[]
[]
[]
[]
[]
[]
[]
[]
[]
[]
[]
[]
[]
[]
[]
[]
[]
[]
[]
[]
[]
[]
[]
[]
[]
[]
[]
[]
[]
[]
[]
[]
[]
[]
[]
[]
[]
[]
[]
[]
[]
[]
[]
[]
[]
[]
[]
[]
[]
[]
[]
[]
[]
[]
[{"$f":"D1482&\" \"&C1482","v":" "}]
[]
[]
[]
[]
[]
[]
[]
[]
[]
[]
[]
[]
[]
[]
[]
[]
[]
[]
[]
[]
[]
[]
[]
[]
[]
[]
[]
[]
[]
[]
[]
[]
[]
[]
[]
[]
[]
[]
[]
[]
[]
[]
[]
[]
[]
[]
[]
[]
[]
[]
[]
[]
[]
[]
[]
[]
[]
[]
[]
[]
[]
[]
[]
[]
[]
[]
[]
[]
[]
[]
[]
[]
[]
[]
[]
[]
[]
[]
[]
[]
[]
[]
[]
[]
[]
[]
[]
[]
[]
[]
[]
[]
[]
[]
[]
[]
[]
[]
[]
[]
[]
[]
[]
[]
[]
[]
[]
[]
[]
[]
[]
[]
[]
[]
[]
[]
[]
[]
[]
[]
[]
[]
[]
[]
[]
[]
[]
[]
[]
[]
[]
[]
[]
[]
[]
[]
[]
[]
[]
[]
[]
[]
[]
[]
[]
[]
[]
[]
[]
[]
[]
[]
[]
[]
[]
[]
[]
[]
[]
[]
[]
[]
[]
[]
[]
[]
[]
[]
[]
[]
[]
[]
[]
[]
[]
[]
[]
[]
[]
[]
[]
[]
[]
[]
[]
[]
[]
[]
[]
[]
[]
[]
[]
[]
[]
[]
[]
[]
[]
[]
[]
[]
[]
[]
[]
[]
[]
[]
[]
[]
[]
[]
[]
[]
[]
[]
[]
[]
[]
[]
[]
[]
[]
[]
[]
[]
[]
[]
[]
[]
[]
[]
[]
[]
[]
[]
[]
[]
[]
[]
[]
[]
[]
[]
[]
[]
[]
[]
[]
[]
[]
[]
[]
[]
[]
[]
[]
[]
[]
[]
[]
[]
[]
[]
[]
[]
[]
[]
[]
[]
[]
[]
[]
[]
[]
[]
[]
[]
[]
[]
[]
[]
[]
[]
[]
[]
[]
[]
[]
[]
[]
[]
[]
[]
[]
[]
[]
[]
[]
[]
[]
[]
[]
[]
[]
[]
[]
[]
[]
[]
[]
[]
[]
[]
[]
[]
[]
[]
[]
[]
[]
[]
[]
[]
[]
[]
[]
[]
[]
[]
[]
[]
[]
[]
[]
[]
[]
[]
[]
[]
[]
[]
[]
[]
[]
[]
[]
[]
[]
[]
[]
[]
[]
[]
[]
[]
[]
[]
[]
[]
[]
[]
[]
[]
[]
[]
[]
[]
[]
[]
[]
[]
[]
[]
[]
[]
[]
[]
[]
[]
[]
[]
[]
[]
[]
[]
[]
[]
[]
[]
[]
[]
[]
[]
[]
[]
[]
[]
[]
[]
[]
[]
[]
[]
[]
[]
[]
[]
[]
[]
[]
[]
[]
[]
[]
[]
[]
[]
[]
[]
[]
[]
[]
[]
[]
[]
[]
[]
[]
[]
[]
[]
[]
[]
[]
[]
[]
[]
[]
[]
[]
[]
[]
[]
[]
[]
[]
[]
[]
[]
[]
[]
[]
[]
[]
[]
[]
[]
[]
[]
[]
[]
[]
[]
[]
[]
[]
[]
[]
[]
[]
[]
[]
[]
[]
[]
[]
[]
[]
[]
[]
[]
[]
[]
[]
[]
[]
[]
[]
[]
[]
[]
[]
[]
[]
[]
[]
[]
[]
[]
[]
[]
[]
[]
[]
[]
[]
[]
[]
[]
[]
[]
[]
[]
[]
[]
[]
[]
[]
[]
[]
[]
[]
[]
[]
[]
[]
[]
[]
[]
[]
[]
[]
[]
[]
[]
[]
[]
[]
[]
[]
[]
[]
[]
[]
[]
[]
[]
[]
[]
[]
[]
[]
[]
[]
[]
[]
[]
[]
[]
[]
[]
[]
[]
[]
[]
[]
[]
[]
[]
[]
[]
[]
[]
[]
[]
[]
[]
[]
[]
[]
[]
[]
[]
[]
[]
[]
[]
[]
[]
[]
[]
[]
[]
[]
[]
[]
[]
[]
[]
[]
[]
[]
[]
[]
[]
[]
[]
[]
[]
[]
[]
[]
[]
[]
[]
[]
[]
[]
[]
[]
[]
[]
[]
[]
[]
[]
[]
[]
[]
[]
[]
[]
[]
[]
[]
[]
[]
[]
[]
[]
[]
[]
[]
[]
[]
[]
[]
[]
[]
[]
[]
[]
[]
[]
[]
[]
[]
[]
[]
[]
[]
[]
[]
[]
[]
[]
[]
[]
[]
[]
[]
[]
[]
[]
[]
[]
[]
[]
[]
[]
[]
[]
[]
[]
[]
[]
[]
[]
[]
[]
[]
[]
[]
[]
[]
[]
[]
[]
[]
[]
[]
[]
[]
[]
[]
[]
[]
[]
[]
[]
[]
[]
[]
[]
[]
[]
[]
[]
[]
[]
[]
[]
[]
[]
[]
[]
[]
[]
[]
[]
[]
[]
[]
[]
[]
[]
[]
[]
[]
[]
[]
[]
[]
[]
[]
[]
[]
[]
[]
[]
[]
[]
[]
[]
[]
[]
[]
[]
[]
[]
[]
[]
[]
[]
[]
[]
[]
[]
[]
[]
[]
[]
[]
[]
[]
[]
[]
[]
[]
[]
[]
[]
[]
[]
[]
[]
[]
[]
[]
[]
[]
[]
[]
[]
[]
[]
[]
[]
[]
[]
[]
[]
[]
[]
[]
[]
[]
[]
[]
[]
[]
[]
[]
[]
[]
[]
[]
[]
[]
[]
[]
[]
[]
[]
[]
[]
[]
[]
[]
[]
[]
[]
[]
[]
[]
[]
[]
[]
[]
[]
[]
[]
[]
[]
[]
[]
[]
[]
[]
[]
[]
[]
[]
[]
[]
[]
[]
[]
[]
[]
[]
[]
[]
[]
[]
[]
[]
[]
[]
[]
[]
[]
[]
[]
[]
[]
[]
[]
[]
[]
[]
[]
[]
[]
[]
[]
[]
[]
[]
[]
[]
[]
[]
[]
[]
[]
[]
[]
[]
[]
[]
[]
[]
[]
[]
[]
[]
[]
[]
[]
[]
[]
[]
[]
[]
[]
[]
[]
[]
[]
[]
[]
[]
[]
[]
[]
[]
[]
[]
[]
[]
[]
[]
[]
[]
[]
[]
[]
[]
[]
[]
[]
[]
[]
[]
[]
[]
[]
[]
[]
[]
[]
[]
[]
[]
[]
[]
[]
[]
[]
[]
[]
[]
[]
[]
[]
[]
[]
[]
[]
[]
[]
[]
[]
[]
[]
[]
[]
[]
[]
[]
[]
[]
[]
[]
[]
[]
[]
[]
[]
[]
[]
[]
[]
[]
[]
[]
[]
[]
[]
[]
[]
[]
[]
[]
[]
[]
[]
[]
[]
[]
[]
[]
[]
[]
[]
[]
[]
[]
[]
[]
[]
[]
[]
[]
[]
[]
[]
[]
[]
[]
[]
[]
[]
[]
[]
[]
[]
[]
[]
[]
[]
[]
[]
[]
[]
[]
[]
[]
[]
[]
[]
[]
[]
[]
[]
[]
[]
[]
[]
[]
[]
[]
[]
[]
[]
[]
[]
[]
[]
[]
[]
[]
[]
[]
[]
[]
[]
[]
[]
[]
[]
[]
[]
[]
[]
[]
[]
[]
[]
[]
[]
[]
[]
[]
[]
[]
[]
[]
[]
[]
[]
[]
[]
[]
[]
[]
[]
[]
[]
[]
[]
[]
[]
[]
[]
[]
[]
[{"$f":"D2602&\" \"&C2602","v":" "}]
[]
[]
[]
[]
[]
[]
[]
[]
[]
[]
[]
[]
[]
[]
[]
[]
[]
[]
[]
[]
[]
[]
[]
[]
[]
[]
[]
[]
[]
[]
[]
[]
[]
[]
[]
[]
[]
[]
[]
[]
[]
[]
[]
[]
[]
[]
[]
[{"$f":"D2650&\" \"&C2650","v":" "}]
[]
[]
[]
[]
[]
[]
[]
[{"$f":"D2658&\" \"&C2658","v":" "}]
[]
[]
[]
[]
[]
[]
[]
[]
[]
[]
[]
[]
[]
[]
[]
[]
[]
[]
[]
[]
[]
[]
[]
[]
[]
[]
[]
[]
[]
[]
[]
[]
[]
[]
[]
[]
[]
[]
[]
[]
[]
[]
[]
[]
[]
[]
[]
[]
[]
[]
[]
[]
[]
[]
[]
[]
[]
[]
[]
[]
[]
[]
[]
[]
[]
[]
[{"$f":"D2725&\" \"&C2725","v":" "}]
[]
[]
[]
[]
[]
[]
[]
[]
[]
[]
[]
[]
[]
[]
[]
[]
[]
[]
[]
[]
[]
[]
[]
[]
[]
[]
[]
[]
[]
[]
[]
[]
[]
[]
[]
[]
[]
[]
[]
[{"$f":"D2765&\" \"&C2765","v":" "}]
[]
[]
[]
[]
[]
[]
[]
[]
[]
[]
[]
[]
[]
[]
[]
[]
[]
[]
[]
[]
[]
[]
[]
[]
[]
[]
[]
[]
[]
[]
[]
[]
[]
[]
[]
[]
[]
[]
[]
[]
[]
[]
[]
[]
[]
[]
[]
[{"$f":"D2813&\" \"&C2813","v":" "}]
[]
[]
[]
[]
[]
[]
[]
[]
[]
[]
[]
[]
[]
[]
[]
[]
[]
[]
[]
[]
[]
[]
[]
[]
[]
[]
[]
[]
[]
[]
[]
[]
[]
[]
[]
[]
[]
[]
[]
[]
[]
[]
[]
[]
[]
[]
[]
[]
[]
[]
[]
[]
[]
[]
[]
[]
[]
[]
[]
[]
[]
[]
[]
[]
[]
[]
[]
[]
[]
[]
[]
[]
[]
[]
[]
[]
[]
[]
[]
[]
[]
[]
[]
[]
[]
[]
[]
[]
[]
[]
[]
[]
[]
[]
[]
[]
[]
[]
[]
[]
[]
[]
[]
[]
[]
[]
[]
[]
[]
[]
[]
[]
[]
[]
[]
[]
[]
[]
[]
[]
[]
[]
[]
[]
[]
[]
[]
[]
[]
[]
[]
[]
[]
[]
[]
[]
[]
[]
[]
[]
[]
[]
[{"$f":"D2956&\" \"&C2956","v":" "}]
[" "]
[" "]
[" "]
[" "]
[" "]
[" "]
[" "]
[" "]
[" "]
[" "]
[" "]
[" "]
[" "]
[" "]
[" "]
[" "]
[" "]
[" "]
[" "]
[" "]
[" "]
[" "]
[" "]
[" "]
[" "]
[" "]
[" "]
[" "]
[" "]
[" "]
[" "]
[{"$f":"D2988&\" \"&C2988","v":" "}]
[" "]
[" "]
[" "]
[" "]
[" "]
[" "]
[" "]
[" "]
[" "]
[" "]
[" "]
[" "]
[" "]
[" "]
[" "]
[" "]
[" "]
[" "]
[" "]
[" "]
[" "]
[" "]
[" "]
[" "]
[" "]
[" "]
[" "]
[" "]
[" "]
[" "]
[" "]
[{"$f":"D3020&\" \"&C3020","v":" "}]
[" "]
[" "]
[" "]
[" "]
[" "]
[" "]
[" "]
[" "]
[" "]
[" "]
[" "]
[" "]
[" "]
[" "]
[" "]
[" "]
[" "]
[" "]
[" "]
[" "]
[" "]
[" "]
[" "]
[" "]
[" "]
[" "]
[" "]
[]
[]
[]
[]
[]
[]
[]
[]
[]
[]
[]
[]
[]
[]
[]
[]
[]
[]
[]
[]
[]
[]
[]
[]
[]
[]
[]
[]
[]
[]
[]
[]
[]
[]
[]
[]
[]
[]
[]
[]
[]
[]
[]
[]
[]
[]
[]
[]
[]
[]
[]
[]
[]
[]
[]
[]
[]
[]
[]
[]
[]
[]
[]
[]
[]
[]
[]
[]
[]
[]
[]
[]
[]
[]
[]
[]
[]
[]
[]
[]
[]
[]
[]
[]
[]
[]
[]
[{"$f":"D3135&\" \"&C3135","v":" "}]
[]
[]
[]
[]
[]
[]
[]
[]
[]
[]
[]
[]
[]
[]
[]
[]
[]
[]
[]
[]
[]
[]
[]
[]
[]
[]
[]
[]
[]
[]
[]
[]
[]
[]
[]
[]
[]
[]
[]
[]
[]
[]
[]
[]
[]
[]
[]
[]
[]
[]
[]
[]
[]
[]
[]
[]
[]
[]
[]
[]
[]
[]
[]
[]
[]
[]
[]
[]
[]
[]
[]
[]
[]
[]
[]
[]
[]
[]
[]
[]
[]
[]
[]
[]
[]
[]
[]
[]
[]
[]
[]
[]
[]
[]
[]
[]
[]
[]
[]
[]
[]
[]
[]
[]
[]
[]
[]
[]
[]
[]
[]
[]
[]
[]
[]
[]
[]
[]
[]
[]
[]
[]
[]
[]
[]
[]
[]
[]
[]
[]
[]
[]
[]
[]
[]
[]
[]
[]
[]
[]
[]
[]
[]
[]
[]
[]
[]
[]
[]
[]
[]
[]
[]
[]
[]
[]
[]
[]
[]
[]
[]
[]
[]
[]
[]
[]
[]
[]
[]
[]
[]
[]
[]
[]
[]
[]
[]
[]
[]
[]
[]
[]
[]
[]
[]
[]
[]
[]
[]
[]
[]
[]
[]
[]
[]
[]
[]
[]
[]
[]
[]
[]
[]
[]
[]
[]
[]
[]
[]
[]
[]
[]
[]
[]
[]
[]
[]
[]
[]
[]
[]
[]
[]
[]
[]
[]
[]
[]
[]
[]
[]
[]
[]
[]
[]
[]
[]
[]
[]
[]
[]
[]
[]
[]
[]
[]
[]
[]
[]
[]
[]
[]
[]
[]
[]
[]
[]
[]
[]
[]
[]
[]
[]
[]
[]
[]
[]
[]
[]
[]
[]
[]
[]
[]
[]
[]
[]
[]
[]
[]
[]
[]
[]
[]
[]
[]
[]
[]
[]
[]
[]
[]
[]
[]
[]
[]
[]
[]
[]
[]
[]
[]
[]
[]
[]
[]
[]
[]
[]
[]
[]
[]
[]
[]
[]
[]
[]
[]
[]
[]
[{"$f":"D3456&\" \"&C3456","v":" "}]
[]
[]
[]
[]
[]
[]
[]
[]
[]
[]
[]
[]
[]
[]
[]
[]
[]
[]
[]
[]
[]
[]
[]
[]
[]
[]
[]
[]
[]
[]
[]
[]
[]
[]
[]
[]
[]
[]
[]
[]
[]
[]
[]
[]
[]
[]
[]
[]
[]
[]
[]
[]
[]
[]
[]
[]
[]
[]
[]
[]
[]
[]
[]
[]
[]
[]
[]
[]
[]
[]
[]
[]
[]
[]
[]
[]
[]
[]
[]
[]
[]
[]
[]
[]
[]
[]
[]
[]
[]
[]
[]
[]
[]
[]
[]
[]
[]
[]
[]
[]
[]
[]
[]
[]
[]
[]
[]
[]
[]
[]
[]
[]
[]
[]
[]
[]
[]
[]
[]
[]
[]
[]
[]
[]
[]
[]
[]
[]
[]
[]
[]
[]
[]
[]
[]
[]
[]
[]
[]
[]
[]
[]
[]
[]
[]
[]
[]
[]
[]
[]
[]
[]
[]
[]
[]
[]
[]
[]
[]
[]
[]
[]
[]
[]
[]
[]
[]
[]
[]
[]
[]
[]
[]
[]
[]
[]
[]
[]
[]
[]
[]
[]
[]
[]
[]
[]
[]
[]
[]
[]
[]
[]
[]
[]
[]
[]
[]
[]
[]
[]
[]
[]
[]
[]
[]
[]
[]
[]
[]
[]
[]
[]
[]
[]
[]
[]
[]
[]
[]
[]
[]
[]
[]
[]
[]
[]
[]
[]
[]
[]
[]
[]
[]
[]
[]
[]
[]
[]
[]
[]
[]
[]
[]
[]
[]
[]
[]
[]
[]
[]
[]
[]
[]
[]
[]
[]
[]
[]
[]
[]
[]
[]
[]
[]
[]
[]
[]
[]
[]
[]
[]
[]
[]
[]
[]
[]
[]
[]
[]
[]
[]
[]
[]
[]
[]
[]
[]
[]
[]
[]
[]
[]
[]
[]
[]
[]
[]
[]
[]
[]
[]
[]
[]
[]
[]
[]
[]
[]
[]
[]
[]
[]
[]
[]
[]
[]
[]
[]
[]
[]
[]
[]
[]
[]
[]
[]
[]
[]
[]
[]
[]
[]
[{"$f":"D3789&\" \"&C3789","v":" "}]
[]
[]
[]
[]
[]
[]
[]
[]
[]
[]
[]
[]
[]
[]
[]
[]
[]
[]
[]
[]
[]
[]
[]
[]
[]
[]
[]
[]
[]
[]
[]
[]
[]
[]
[]
[]
[]
[]
[]
[]
[]
[]
[]
[]
[]
[]
[]
[]
[]
[]
[]
[]
[]
[]
[]
[]
[]
[]
[]
[]
[]
[]
[]
[]
[]
[]
[]
[]
[]
[]
[]
[]
[]
[]
[]
[]
[]
[]
[]
[]
[]
[]
[]
[]
[]
[]
[]
[]
[]
[]
[]
[]
[]
[]
[]
[]
[]
[]
[]
[]
[]
[]
[]
[]
[]
[]
[]
[]
[]
[]
[]
[]
[]
[]
[]
[]
[]
[]
[]
[]
[]
[]
[]
[]
[]
[]
[]
[]
[]
[]
[]
[]
[]
[]
[]
[]
[]
[]
[]
[]
[]
[]
[]
[]
[]
[]
[]
[]
[]
[]
[]
[]
[]
[]
[]
[]
[]
[]
[]
[]
[]
[]
[]
[]
[]
[]
[]
[]
[]
[]
[]
[]
[]
[]
[]
[]
[]
[]
[]
[]
[]
[]
[]
[]
[]
[]
[]
[]
[]
[]
[]
[]
[]
[]
[]
[]
[]
[]
[]
[]
[]
[]
[]
[]
[]
[]
[]
[]
[]
[]
[]
[]
[]
[]
[]
[]
[]
[]
[]
[]
[]
[]
[]
[]
[]
[]
[]
[]
[]
[]
[]
[]
[]
[]
[]
[]
[]
[]
[]
[]
[]
[]
[]
[]
[]
[]
[]
[]
[]
[]
[]
[]
[]
[]
[]
[]
[]
[]
[]
[]
[]
[]
[]
[]
[]
[]
[]
[]
[]
[]
[]
[]
[]
[]
[]
[]
[]
[]
[]
[]
[]
[]
[]
[]
[]
[]
[]
[]
[]
[]
[]
[]
[]
[]
[]
[]
[]
[]
[{"$f":"D4088&\" \"&C4088","v":" "}]
[]
[]
[]
[]
[]
[]
[]
[]
[]
[]
[]
[]
[]
[]
[]
[]
[]
[]
[]
[]
[]
[]
[]
[]
[]
[]
[]
[]
[]
[]
[]
[]
[]
[]
[]
[]
[]
[]
[]
[]
[]
[]
[]
[]
[]
[]
[]
[]
[]
[]
[]
[]
[]
[]
[]
[]
[]
[]
[]
[]
[]
[]
[]
[]
[]
[]
[]
[]
[]
[]
[]
[]
[]
[]
[]
[]
[]
[]
[]
[]
[]
[]
[]
[]
[]
[]
[]
[]
[]
[]
[]
[]
[]
[]
[]
[]
[]
[]
[]
[]
[]
[]
[]
[]
[]
[]
[]
[]
[]
[]
[]
[]
[]
[]
[]
[]
[]
[]
[]
[]
[]
[]
[]
[]
[]
[]
[]
[]
[]
[]
[]
[]
[]
[]
[]
[]
[]
[]
[]
[]
[]
[]
[]
[]
[]
[]
[]
[]
[]
[]
[]
[]
[]
[]
[]
[]
[]
[]
[]
[]
[]
[]
[]
[]
[]
[]
[]
[]
[]
[]
[]
[]
[]
[]
[]
[]
[]
[]
[]
[]
[]
[]
[]
[]
[]
[]
[]
[]
[]
[]
[]
[]
[]
[]
[]
[]
[]
[]
[]
[]
[]
[]
[]
[]
[]
[]
[]
[]
[]
[]
[]
[]
[]
[]
[]
[]
[]
[]
[]
[]
[]
[]
[]
[]
[]
[]
[]
[]
[]
[]
[]
[]
[]
[]
[]
[]
[]
[]
[]
[]
[]
[]
[]
[]
[]
[]
[]
[]
[]
[]
[]
[]
[]
[]
[]
[]
[]
[]
[]
[]
[]
[]
[]
[]
[]
[]
[]
[]
[]
[]
[]
[]
[]
[]
[]
[]
[]
[]
[]
[]
[]
[]
[]
[]
[]
[]
[]
[]
[]
[]
[]
[]
[]
[]
[]
[]
[]
[]
[]
[]
[]
[]
[]
[]
[]
[]
[]
[]
[]
[]
[]
[]
[]
[]
[]
[]
[]
[]
[]
[]
[]
[]
[]
[]
[]
[]
[]
[]
[]
[]
[]
[]
[]
[]
[]
[]
[]
[]
[]
[]
[]
[]
[]
[]
[]
[]
[]
[]
[]
[]
[]
[]
[]
[]
[]
[]
[]
[]
[]
[]
[]
[]
[]
[]
[]
[]
[]
[]
[]
[]
[]
[]
[]
[]
[]
[]
[]
[]
[]
[]
[]
[]
[]
[]
[]
[]
[]
[]
[]
[]
[]
[]
[]
[]
[]
[]
[]
[]
[]
[]
[]
[]
[]
[]
[]
[]
[]
[]
[]
[]
[]
[]
[]
[]
[]
[]
[]
[]
[]
[]
[]
[]
[]
[]
[]
[]
[]
[]
[]
[]
[]
[]
[]
[]
[]
[]
[]
[]
[]
[]
[]
[]
[]
[]
[]
[]
[]
[]
[]
[]
[]
[]
[]
[]
[]
[]
[]
[]
[]
[]
[]
[]
[]
[]
[]
[]
[]
[]
[]
[]
[]
[]
[]
[]
[]
[]
[]
[]
[]
[]
[]
[]
[]
[]
[]
[]
[]
[]
[]
[]
[]
[]
[]
[]
[]
[]
[]
[]
[]
[]
[]
[]
[]
[]
[]
[]
[]
[]
[]
[]
[]
[]
[]
[]
[]
[]
[]
[]
[]
[]
[]
[]
[]
[]
[]
[]
[]
[]
[]
[]
[]
[]
[]
[]
[]
[]
[]
[]
[]
[]
[]
[]
[]
[]
[]
[]
[]
[]
[]
[]
[]
[]
[]
[]
[]
[]
[]
[]
[]
[]
[]
[]
[]
[]
[]
[]
[]
[]
[]
[]
[]
[]
[]
[]
[]
[]
[]
[]
[]
[]
[]
[]
[]
[]
[]
[]
[]
[]
[]
[]
[]
[]
[]
[]
[]
[]
[]
[]
[]
[]
[]
[]
[]
[]
[]
[]
[]
[]
[]
[]
[]
[]
[]
[]
[]
[]
[]
[]
[]
[]
[]
[]
[]
[]
[]
[]
[]
[]
[]
[]
[]
[]
[]
[]
[]
[]
[]
[]
[]
[]
[]
[]
[]
[]
[]
[]
[]
[]
[]
[]
[]
[]
[]
[]
[]
[]
[]
[]
[]
[]
[]
[]
[]
[]
[]
[]
[]
[]
[]
[]
[]
[]
[]
[]
[]
[]
[]
[]
[]
[]
[]
[]
[]
[]
[]
[]
[]
[]
[{"$f":"D4777&\" \"&C4777","v":" "}]
[]
[]
[]
[]
[]
[]
[]
[]
[]
[]
[]
[]
[]
[]
[]
[]
[]
[]
[]
[]
[]
[]
[]
[]
[]
[]
[]
[]
[]
[]
[]
[]
[]
[]
[]
[{"$f":"D4813&\" \"&C4813","v":" "}]
[]
[]
[]
[{"$f":"D4817&\" \"&C4817","v":" "}]
[]
[]
[]
[]
[]
[]
[]
[]
[]
[]
[]
[]
[]
[]
[]
[]
[]
[]
[]
[]
[]
[{"$f":"D4839&\" \"&C4839","v":" "}]
[]
[]
[]
[]
[]
[]
[]
[]
[]
[]
[]
[]
[]
[]
[]
[]
[]
[]
[]
[]
[]
[]
[]
[]
[]
[]
[]
[]
[]
[]
[]
[]
[]
[]
[]
[]
[]
[]
[]
[]
[]
[]
[]
[]
[]
[]
[]
[]
[]
[]
[]
[]
[]
[]
[]
[]
[]
[]
[]
[]
[]
[]
[]
[]
[]
[]
[]
[]
[]
[]
[]
[]
[]
[]
[]
[]
[]
[]
[]
[]
[]
[]
[]
[]
[]
[]
[{"$f":"D4926&\" \"&C4926","v":" "}]
[]
[]
[]
[]
[]
[]
[]
[]
[]
[]
[{"$f":"D4937&\" \"&C4937","v":" "}]
[]
[]
[]
[]
[]
[]
[]
[]
[]
[]
[]
[]
[]
[]
[]
[]
[]
[]
[]
[]
[]
[]
[]
[]
[]
[]
[]
[]
[]
[]
[]
[]
[]
[]
[]
[]
[]
[]
[]
[]
[]
[]
[]
[]
[]
[]
[]
[]
[]
[]
[]
[]
[]
[]
[]
[]
[]
[]
[]
[]
[]
[]
[]
[]
[]
[]
[]
[]
[]
[]
[]
[]
[]
[]
[]
[]
[]
[]
[]
[]
[]
[]
[]
[]
[]
[]
[]
[]
[]
[]
[]
[]
[]
[]
[]
[]
[]
[]
[]
[]
[]
[]
[]
[]
[]
[]
[]
[]
[]
[]
[]
[]
[]
[]
[]
[]
[]
[]
[]
[]
[]
[]
[]
[]
[]
[]
[]
[]
[]
[]
[]
[]
[]
[]
[]
[]
[]
[]
[]
[]
[]
[]
[]
[]
[]
[]
[]
[]
[]
[]
[]
[]
[]
[]
[]
[]
[]
[]
[]
[]
[]
[]
[]
[]
[]
[]
[]
[]
[]
[]
[]
[{"$f":"D5109&\" \"&C5109","v":" "}]
[]
[]
[]
[]
[]
[]
[]
[]
[]
[]
[]
[]
[]
[]
[]
[]
[]
[]
[]
[]
[]
[]
[]
[{"$f":"D5133&\" \"&C5133","v":" "}]
[]
[]
[]
[]
[]
[]
[]
[]
[]
[]
[]
[]
[]
[]
[]
[]
[]
[]
[]
[]
[]
[]
[]
[]
[]
[]
[]
[]
[]
[]
[]
[]
[]
[]
[]
[]
[]
[]
[]
[]
[]
[]
[]
[]
[]
[]
[]
[]
[]
[]
[]
[]
[]
[]
[]
[]
[]
[]
[]
[]
[]
[]
[]
[]
[]
[]
[]
[]
[]
[]
[]
[]
[]
[]
[]
[]
[]
[]
[]
[]
[]
[]
[]
[]
[]
[]
[]
[]
[]
[]
[]
[]
[]
[]
[]
[]
[]
[]
[]
[]
[]
[]
[]
[]
[]
[]
[]
[]
[]
[]
[]
[]
[]
[]
[]
[]
[]
[]
[]
[]
[]
[]
[]
[]
[]
[]
[]
[]
[]
[]
[]
[]
[]
[]
[]
[]
[]
[]
[]
[]
[]
[]
[]
[]
[]
[]
[]
[]
[]
[]
[]
[]
[]
[]
[]
[]
[]
[]
[]
[]
[]
[]
[]
[]
[]
[]
[]
[]
[]
[]
[]
[]
[]
[]
[]
[]
[]
[]
[]
[]
[]
[]
[]
[]
[]
[]
[]
[]
[]
[]
[]
[]
[]
[]
[]
[]
[]
[]
[]
[]
[]
[]
[]
[]
[]
[]
[{"$f":"D5340&\" \"&C5340","v":" "}]
[]
[]
[]
[]
[]
[]
[]
[]
[]
[]
[]
[]
[]
[]
[]
[]
[]
[]
[]
[]
[]
[]
[]
[]
[]
[]
[]
[]
[]
[]
[]
[]
[]
[]
[]
[]
[]
[]
[]
[]
[]
[]
[]
[]
[]
[]
[]
[]
[]
[]
[]
[]
[]
[]
[]
[]
[]
[]
[]
[]
[]
[]
[]
[]
[]
[]
[]
[]
[]
[]
[]
[]
[]
[]
[]
[]
[]
[]
[]
[]
[]
[]
[]
[]
[]
[]
[]
[]
[]
[]
[]
[]
[]
[]
[]
[]
[]
[]
[]
[]
[]
[]
[]
[]
[]
[]
[]
[]
[]
[]
[]
[]
[]
[]
[]
[]
[]
[]
[]
[]
[]
[]
[]
[]
[]
[]
[]
[]
[]
[]
[]
[]
[]
[]
[]
[]
[]
[]
[]
[]
[]
[]
[]
[]
[]
[]
[]
[]
[]
[]
[]
[]
[]
[]
[]
[]
[]
[]
[]
[]
[]
[]
[]
[]
[]
[]
[]
[]
[]
[]
[]
[]
[]
[]
[]
[]
[{"$f":"D5517&\" \"&C5517","v":" "}]
[]
[]
[]
[]
[]
[]
[]
[]
[]
[]
[]
[]
[]
[]
[]
[]
[]
[]
[]
[]
[]
[]
[]
[]
[]
[]
[{"$f":"D5544&\" \"&C5544","v":" "}]
[]
[]
[]
[]
[]
[]
[]
[]
[]
[]
[]
[]
[]
[]
[]
[]
[]
[]
[]
[]
[]
[]
[]
[]
[]
[]
[]
[]
[]
[]
[]
[]
[]
[]
[]
[]
[]
[]
[]
[]
[]
[]
[]
[]
[]
[]
[{"$f":"D5591&\" \"&C5591","v":" "}]
[]
[]
[]
[]
[]
[]
[]
[]
[]
[]
[]
[]
[]
[]
[]
[]
[]
[]
[]
[]
[]
[]
[]
[]
[]
[{"$f":"D5617&\" \"&C5617","v":" "}]
[]
[]
[]
[]
[]
[]
[]
[]
[]
[]
[]
[]
[]
[]
[]
[]
[]
[]
[]
[]
[]
[]
[]
[]
[]
[]
[]
[]
[]
[]
[]
[]
[]
[]
[]
[]
[]
[]
[]
[]
[]
[]
[]
[]
[{"$f":"D5662&\" \"&C5662","v":" "}]
[{"$f":"D5663&\" \"&C5663","v":" "}]
[]
[]
[]
[]
[]
[]
[]
[]
[]
[]
[]
[]
[]
[]
[]
[]
[]
[]
[]
[]
[]
[]
[]
[]
[]
[]
[]
[]
[]
[]
[]
[]
[]
[]
[]
[]
[]
[]
[]
[]
[]
[]
[]
[]
[]
[]
[]
[]
[]
[]
[]
[]
[]
[]
[]
[]
[]
[]
[]
[]
[]
[]
[]
[]
[]
[]
[]
[]
[]
[]
[]
[]
[]
[]
[]
[]
[]
[]
[]
[]
[]
[]
[]
[]
[]
[]
[]
[]
[]
[]
[]
[]
[]
[]
[]
[]
[]
[]
[]
[]
[]
[]
[]
[]
[]
[]
[]
[]
[]
[]
[]
[]
[]
[]
[]
[]
[]
[]
[]
[]
[]
[]
[]
[]
[]
[]
[]
[]
[]
[]
[]
[]
[]
[]
[]
[]
[]
[]
[]
[]
[]
[]
[]
[]
[]
[]
[]
[]
[]
[]
[]
[]
[]
[]
[]
[]
[]
[]
[]
[]
[]
[]
[]
[]
[]
[]
[]
[]
[]
[]
[]
[]
[]
[]
[]
[]
[]
[]
[]
[]
[]
[{"$f":"D5845&\" \"&C5845","v":" "}]
[]
[]
[]
[]
[]
[]
[]
[]
[]
[]
[]
[]
[]
[]
[]
[]
[]
[]
[]
[]
[]
[]
[]
[]
[]
[]
[]
[]
[]
[]
[]
[]
[]
[]
[]
[]
[]
[]
[]
[]
[]
[]
[]
[]
[]
[]
[]
[]
[]
[]
[]
[]
[]
[]
[]
[]
[]
[]
[]
[]
[]
[]
[]
[]
[]
[]
[]
[]
[]
[]
[]
[]
[]
[]
[]
[]
[]
[]
[]
[]
[]
[]
[]
[]
[]
[]
[]
[]
[]
[]
[]
[]
[]
[]
[]
[]
[]
[]
[]
[]
[]
[]
[]
[]
[]
[]
[]
[]
[]
[]
[]
[]
[]
[]
[]
[]
[]
[]
[]
[]
[]
[]
[]
[]
[]
[]
[]
[]
[]
[]
[]
[]
[]
[]
[]
[]
[]
[]
[]
[]
[]
[]
[]
[]
[]
[]
[]
[]
[]
[]
[]
[]
[]
[]
[]
[]
[]
[]
[]
[]
[]
[]
[]
[]
[]
[]
[]
[]
[]
[]
[]
[]
[]
[]
[]
[]
[]
[]
[]
[]
[]
[]
[]
[]
[]
[]
[]
[]
[]
[]
[]
[]
[]
[]
[]
[]
[]
[]
[]
[]
[]
[]
[]
[]
[]
[]
[]
[]
[]
[]
[]
[]
[]
[]
[]
[{"$f":"D6061&\" \"&C6061","v":" "}]
[]
[]
[]
[]
[]
[]
[]
[]
[]
[]
[]
[]
[]
[]
[]
[]
[]
[]
[]
[]
[]
[]
[]
[]
[]
[]
[]
[]
[]
[]
[]
[]
[]
[]
[]
[]
[]
[]
[]
[]
[]
[]
[]
[]
[]
[]
[]
[]
[]
[]
[]
[]
[]
[]
[]
[]
[]
[]
[]
[]
[]
[]
[]
[]
[]
[]
[]
[]
[]
[]
[]
[]
[]
[]
[]
[]
[]
[]
[]
[]
[]
[]
[]
[]
[]
[]
[]
[]
[]
[]
[]
[]
[]
[]
[]
[]
[]
[]
[]
[]
[]
[]
[]
[]
[]
[]
[]
[]
[]
[]
[]
[]
[]
[]
[]
[]
[]
[]
[]
[]
[]
[]
[]
[]
[]
[]
[]
[]
[]
[]
[]
[]
[]
[]
[]
[]
[]
[]
[]
[]
[]
[]
[]
[]
[]
[]
[]
[]
[]
[]
[]
[]
[]
[]
[]
[]
[]
[]
[]
[]
[]
[]
[]
[]
[]
[]
[]
[]
[]
[]
[]
[]
[]
[]
[]
[]
[]
[]
[]
[]
[]
[]
[]
[]
[]
[]
[]
[]
[]
[]
[]
[]
[]
[]
[]
[]
[]
[]
[]
[]
[]
[]
[]
[]
[]
[]
[]
[]
[]
[]
[]
[]
[]
[]
[]
[]
[]
[]
[]
[]
[]
[]
[]
[]
[]
[]
[]
[]
[]
[]
[]
[]
[]
[]
[]
[]
[]
[]
[]
[]
[]
[]
[]
[]
[]
[]
[]
[]
[]
[]
[]
[]
[]
[]
[]
[]
[]
[]
[]
[]
[]
[]
[]
[]
[]
[]
[]
[]
[]
[]
[]
[]
[]
[]
[]
[]
[]
[]
[]
[]
[]
[]
[]
[]
[]
[]
[]
[]
[]
[]
[]
[]
[]
[]
[]
[]
[]
[]
[]
[]
[]
[]
[]
[]
[]
[]
[]
[]
[]
[]
[]
[]
[]
[]
[]
[]
[]
[]
[]
[]
[]
[]
[]
[]
[]
[]
[]
[]
[]
[]
[]
[]
[]
[]
[]
[]
[]
[]
[]
[]
[]
[]
[]
[]
[]
[]
[]
[]
[]
[]
[]
[]
[]
[]
[]
[]
[]
[]
[]
[]
[]
[]
[]
[]
[]
[]
[]
[]
[]
[]
[]
[]
[]
[]
[]
[]
[]
[]
[{"$f":"D6440&\" \"&C6440","v":" "}]
[]
[]
[]
[]
[]
[]
[]
[]
[]
[]
[]
[]
[]
[]
[]
[]
[]
[]
[]
[]
[]
[]
[]
[]
[]
[]
[]
[]
[]
[]
[]
[]
[]
[]
[]
[]
[]
[]
[]
[]
[]
[]
[]
[]
[]
[]
[]
[]
[]
[]
[]
[]
[]
[]
[]
[]
[]
[]
[]
[]
[]
[]
[]
[]
[]
[]
[]
[]
[]
[]
[]
[]
[]
[]
[]
[]
[]
[]
[]
[]
[]
[]
[]
[]
[]
[]
[]
[]
[]
[]
[]
[]
[]
[]
[]
[]
[]
[]
[]
[]
[]
[]
[]
[]
[]
[]
[]
[]
[]
[]
[]
[]
[]
[]
[]
[]
[]
[]
[]
[]
[]
[]
[]
[]
[]
[]
[]
[]
[]
[]
[]
[]
[]
[]
[]
[]
[]
[]
[]
[]
[]
[]
[]
[]
[]
[]
[]
[]
[]
[]
[]
[]
[]
[]
[]
[]
[]
[]
[]
[]
[]
[]
[]
[]
[]
[]
[]
[]
[]
[]
[]
[]
[]
[]
[]
[]
[]
[]
[]
[]
[]
[]
[]
[]
[]
[]
[]
[]
[]
[]
[]
[]
[]
[]
[]
[]
[]
[]
[]
[]
[]
[]
[]
[]
[]
[]
[]
[]
[]
[]
[]
[]
[]
[]
[]
[]
[]
[]
[]
[]
[]
[]
[]
[]
[]
[]
[]
[]
[]
[]
[]
[]
[]
[]
[]
[]
[]
[]
[]
[]
[]
[]
[]
[]
[]
[]
[]
[]
[]
[]
[]
[]
[]
[]
[]
[]
[]
[]
[]
[]
[]
[]
[]
[]
[]
[]
[]
[]
[]
[]
[]
[]
[]
[]
[]
[]
[]
[]
[]
[]
[]
[]
[]
[]
[]
[]
[]
[]
[]
[]
[]
[]
[]
[]
[]
[]
[]
[]
[]
[]
[]
[]
[]
[]
[]
[]
[]
[]
[]
[]
[]
[]
[]
[]
[]
[]
[]
[]
[]
[]
[]
[]
[]
[]
[]
[]
[]
[]
[]
[]
[]
[]
[]
[]
[]
[]
[]
[]
[]
[]
[]
[]
[]
[]
[]
[]
[]
[]
[]
[]
[]
[]
[]
[]
[]
[]
[]
[]
[]
[]
[]
[]
[]
[]
[]
[]
[]
[]
[]
[]
[]
[]
[]
[]
[]
[]
[]
[]
[]
[]
[]
[]
[]
[]
[]
[]
[]
[]
[]
[]
[]
[]
[]
[]
[]
[]
[]
[]
[]
[]
[]
[]
[]
[]
[]
[]
[]
[]
[]
[]
[]
[]
[]
[]
[]
[]
[]
[]
[]
[]
[]
[]
[]
[]
[]
[]
[]
[]
[]
[]
[]
[]
[]
[]
[]
[]
[]
[]
[]
[]
[]
[]
[]
[]
[]
[]
[]
[]
[]
[]
[]
[]
[]
[]
[]
[]
[]
[]
[]
[]
[]
[]
[]
[]
[]
[]
[]
[]
[]
[]
[]
[]
[]
[]
[]
[]
[]
[]
[]
[]
[]
[]
[]
[]
[]
[]
[]
[]
[]
[]
[]
[]
[]
[]
[]
[]
[]
[]
[]
[]
[]
[]
[]
[]
[]
[]
[]
[]
[]
[]
[]
[]
[]
[]
[]
[]
[]
[]
[]
[]
[]
[]
[]
[]
[]
[]
[]
[]
[]
[]
[]
[]
[]
[]
[]
[]
[]
[]
[]
[]
[]
[]
[]
[]
[]
[]
[]
[]
[]
[]
[]
[]
[]
[]
[]
[]
[]
[]
[]
[]
[]
[]
[]
[]
[]
[]
[]
[]
[]
[]
[]
[]
[]
[]
[]
[]
[]
[]
[]
[]
[]
[]
[]
[]
[]
[]
[]
[]
[]
[]
[]
[]
[]
[]
[]
[]
[]
[]
[]
[]
[]
[]
[]
[]
[]
[]
[]
[]
[]
[]
[]
[{"$f":"D7052&\" \"&C7052","v":" "}]
[]
[]
[]
[]
[]
[]
[]
[]
[]
[]
[]
[]
[]
[]
[]
[]
[]
[]
[]
[]
[]
[]
[]
[]
[]
[]
[]
[]
[]
[]
[]
[]
[]
[]
[]
[]
[]
[]
[]
[]
[]
[]
[]
[]
[]
[]
[]
[]
[]
[]
[]
[]
[]
[]
[]
[]
[]
[]
[]
[]
[]
[]
[]
[]
[]
[]
[]
[]
[]
[]
[]
[]
[]
[]
[]
[]
[]
[]
[]
[]
[]
[]
[]
[]
[]
[]
[]
[]
[]
[]
[]
[]
[]
[]
[]
[]
[]
[]
[]
[]
[]
[]
[]
[]
[]
[]
[]
[]
[]
[]
[]
[]
[]
[]
[]
[]
[]
[]
[]
[]
[]
[]
[]
[]
[]
[]
[]
[]
[]
[]
[]
[]
[]
[]
[]
[]
[]
[]
[]
[]
[]
[]
[]
[]
[]
[]
[]
[]
[]
[]
[]
[]
[]
[]
[]
[]
[]
[]
[]
[]
[]
[]
[]
[]
[]
[]
[]
[]
[]
[]
[]
[]
[]
[]
[]
[]
[]
[]
[]
[]
[]
[]
[]
[]
[]
[]
[]
[]
[]
[]
[]
[]
[]
[]
[]
[]
[]
[]
[]
[]
[]
[]
[]
[]
[]
[]
[]
[]
[]
[]
[]
[]
[]
[]
[]
[]
[]
[]
[]
[]
[]
[]
[]
[]
[]
[]
[]
[]
[]
[]
[]
[]
[]
[]
[]
[]
[]
[]
[]
[]
[]
[]
[]
[]
[]
[]
[]
[]
[]
[]
[]
[]
[]
[]
[]
[]
[]
[]
[]
[]
[]
[]
[]
[]
[]
[]
[]
[]
[]
[]
[]
[]
[]
[]
[]
[]
[]
[]
[]
[]
[]
[]
[]
[]
[]
[]
[]
[]
[]
[]
[]
[]
[]
[]
[]
[]
[]
[]
[]
[]
[]
[]
[]
[]
[]
[]
[]
[]
[]
[]
[]
[]
[]
[]
[]
[]
[]
[]
[]
[]
[]
[]
[]
[]
[]
[]
[]
[]
[]
[]
[]
[]
[]
[]
[]
[]
[]
[]
[]
[]
[]
[]
[]
[]
[]
[]
[]
[]
[]
[]
[]
[]
[]
[]
[]
[]
[]
[]
[]
[]
[]
[]
[]
[]
[]
[]
[]
[]
[]
[]
[]
[]
[]
[]
[]
[]
[]
[]
[]
[]
[]
[]
[]
[]
[]
[]
[]
[]
[]
[]
[]
[]
[]
[]
[]
[]
[]
[]
[]
[]
[]
[]
[]
[]
[]
[]
[]
[]
[]
[]
[]
[]
[{"$f":"D7465&\" \"&C7465","v":" "}]
[]
[]
[]
[]
[]
[]
[]
[]
[]
[]
[]
[]
[]
[]
[]
[]
[]
[]
[]
[]
[]
[]
[]
[]
[]
[]
[]
[]
[]
[]
[]
[]
[]
[]
[]
[]
[]
[]
[]
[]
[]
[]
[]
[]
[]
[]
[]
[]
[]
[]
[]
[]
[]
[]
[]
[]
[]
[]
[]
[]
[]
[]
[]
[]
[]
[]
[]
[]
[]
[]
[]
[]
[]
[]
[]
[]
[]
[]
[]
[]
[]
[]
[]
[]
[]
[]
[]
[]
[{"$f":"D7554&\" \"&C7554","v":" "}]
[]
[]
[{"$f":"D7557&\" \"&C7557","v":" "}]
[]
[]
[]
[]
[]
[]
[]
[]
[]
[]
[]
[]
[{"$f":"D7570&\" \"&C7570","v":" "}]
[]
[]
[]
[]
[]
[]
[]
[]
[]
[]
[]
[]
[]
[]
[]
[]
[]
[]
[]
[{"$f":"D7590&\" \"&C7590","v":" "}]
[]
[]
[]
[]
[]
[]
[]
[]
[]
[]
[{"$f":"D7601&\" \"&C7601","v":" "}]
[]
[]
[]
[]
[]
[]
[]
[]
[]
[]
[]
[]
[]
[]
[]
[]
[]
[]
[]
[]
[]
[]
[]
[]
[{"$f":"D7626&\" \"&C7626","v":" "}]
[{"$f":"D7627&\" \"&C7627","v":" "}]
[]
[]
[]
[]
[]
[]
[]
[]
[]
[]
[]
[]
[]
[{"$f":"D7641&\" \"&C7641","v":" "}]
[]
[]
[]
[]
[]
[]
[]
[]
[]
[]
[]
[]
[]
[]
[]
[]
[]
[]
[]
[]
[]
[]
[]
[]
[]
[]
[]
[]
[]
[]
[]
[]
[]
[]
[]
[]
[]
[]
[]
[]
[]
[]
[]
[]
[]
[]
[]
[]
[]
[]
[]
[]
[]
[]
[]
[]
[]
[]
[]
[]
[]
[]
[]
[]
[]
[]
[]
[]
[]
[]
[]
[]
[]
[]
[]
[]
[]
[]
[]
[]
[]
[]
[]
[]
[]
[]
[]
[]
[]
[]
[]
[]
[]
[]
[]
[]
[]
[]
[]
[]
[]
[]
[]
[]
[]
[]
[]
[]
[]
[]
[]
[]
[]
[]
[]
[]
[]
[]
[]
[]
[]
[]
[]
[]
[]
[]
[]
[]
[]
[]
[]
[]
[]
[]
[]
[]
[]
[]
[]
[]
[]
[]
[]
[]
[]
[]
[]
[]
[]
[]
[]
[]
[]
[]
[]
[]
[]
[]
[]
[]
[]
[]
[]
[]
[]
[]
[]
[]
[]
[]
[]
[]
[]
[]
[]
[]
[]
[]
[]
[]
[]
[]
[]
[]
[]
[]
[]
[]
[]
[]
[]
[]
[]
[]
[]
[]
[]
[]
[]
[]
[]
[]
[]
[]
[]
[]
[]
[]
[]
[]
[]
[]
[]
[]
[]
[]
[]
[]
[]
[]
[]
[]
[]
[]
[]
[]
[]
[]
[]
[]
[]
[]
[]
[]
[]
[]
[]
[]
[]
[]
[]
[]
[]
[]
[]
[]
[]
[]
[]
[]
[]
[]
[]
[]
[]
[]
[]
[]
[]
[]
[]
[]
[]
[]
[]
[]
[]
[]
[]
[]
[]
[]
[]
[]
[]
[]
[]
[]
[]
[]
[]
[]
[]
[]
[]
[]
[]
[]
[]
[]
[]
[]
[]
[]
[]
[]
[]
[]
[]
[]
[]
[]
[]
[]
[]
[]
[]
[]
[]
[]
[]
[]
[]
[]
[]
[]
[]
[]
[]
[]
[]
[]
[]
[]
[]
[]
[]
[]
[]
[]
[]
[]
[]
[]
[]
[]
[]
[]
[]
[]
[]
[]
[]
[]
[]
[]
[]
[]
[]
[]
[]
[]
[]
[]
[]
[]
[]
[]
[]
[]
[]
[]
[]
[]
[]
[]
[]
[]
[]
[]
[]
[]
[]
[]
[]
[]
[]
[]
[]
[]
[]
[]
[]
[]
[]
[]
[]
[]
[]
[]
[]
[]
[]
[]
[]
[]
[]
[]
[]
[]
[]
[]
[]
[]
[]
[]
[]
[]
[]
[]
[]
[]
[]
[]
[]
[]
[]
[]
[]
[]
[]
[]
[]
[]
[]
[]
[]
[]
[]
[]
[]
[]
[]
[]
[]
[]
[]
[]
[]
[]
[]
[]
[]
[]
[]
[]
[]
[]
[]
[]
[]
[]
[]
[]
[]
[]
[]
[]
[]
[]
[]
[]
[]
[]
[]
[]
[]
[]
[]
[]
[]
[]
[]
[]
[]
[]
[]
[]
[]
[]
[]
[]
[]
[]
[]
[]
[]
[]
[]
[]
[]
[]
[]
[]
[]
[]
[]
[]
[]
[]
[]
[]
[]
[]
[]
[]
[]
[]
[]
[]
[]
[]
[]
[]
[]
[]
[]
[]
[]
[]
[]
[]
[]
[]
[]
[]
[]
[]
[]
[]
[]
[]
[]
[]
[]
[]
[]
[]
[]
[]
[]
[]
[]
[]
[]
[]
[]
[]
[]
[]
[]
[]
[]
[]
[]
[]
[]
[]
[]
[]
[]
[]
[]
[]
[]
[]
[]
[]
[]
[]
[]
[]
[]
[]
[]
[]
[]
[]
[]
[]
[]
[]
[]
[]
[]
[]
[]
[]
[]
[]
[]
[]
[]
[]
[]
[]
[]
[]
[]
[]
[]
[]
[]
[]
[]
[]
[]
[]
[]
[]
[]
[]
[]
[]
[]
[]
[]
[]
[]
[]
[]
[]
[]
[]
[]
[]
[]
[]
[]
[]
[]
[]
[]
[]
[]
[]
[]
[]
[]
[]
[]
[]
[]
[]
[]
[]
[]
[]
[]
[]
[]
[]
[]
[]
[]
[]
[]
[]
[]
[]
[]
[]
[]
[]
[]
[]
[]
[]
[]
[]
[]
[]
[]
[]
[]
[]
[]
[]
[]
[]
[]
[]
[]
[]
[]
[]
[]
[]
[]
[]
[]
[]
[]
[]
[]
[]
[]
[]
[]
[]
[]
[]
[]
[]
[]
[]
[]
[]
[]
[]
[]
[]
[]
[]
[]
[]
[]
[]
[]
[]
[]
[]
[]
[]
[]
[]
[]
[]
[]
[]
[]
[]
[]
[]
[]
[]
[]
[]
[]
[{"$f":"D8381&\" \"&C8381","v":" "}]
[]
[]
[]
[]
[{"$f":"D8386&\" \"&C8386","v":" "}]
[]
[]
[{"$f":"D8389&\" \"&C8389","v":" "}]
[]
[]
[]
[]
[]
[]
[]
[]
[]
[]
[]
[]
[]
[]
[]
[]
[]
[]
[]
[]
[]
[]
[]
[]
[]
[]
[]
[]
[]
[]
[]
[]
[]
[]
[]
[]
[]
[]
[]
[]
[]
[]
[]
[]
[]
[]
[]
[]
[]
[]
[]
[]
[]
[]
[]
[]
[]
[]
[]
[]
[]
[]
[]
[]
[]
[]
[]
[]
[]
[]
[]
[]
[]
[]
[]
[]
[]
[]
[]
[]
[]
[]
[]
[]
[]
[]
[]
[]
[]
[]
[]
[]
[]
[]
[]
[]
[]
[]
[]
[]
[]
[]
[]
[]
[]
[]
[]
[]
[]
[]
[]
[]
[]
[]
[]
[]
[]
[]
[]
[]
[]
[]
[]
[]
[]
[]
[]
[]
[]
[]
[]
[]
[]
[]
[]
[]
[]
[]
[]
[]
[]
[]
[]
[]
[]
[]
[]
[]
[]
[]
[]
[]
[]
[]
[]
[]
[]
[]
[]
[]
[]
[]
[]
[]
[]
[]
[]
[]
[]
[]
[]
[]
[]
[]
[]
[]
[]
[]
[]
[]
[]
[]
[]
[]
[]
[]
[]
[]
[]
[]
[]
[]
[]
[]
[]
[]
[]
[]
[]
[]
[]
[]
[]
[]
[]
[]
[]
[]
[]
[]
[]
[]
[]
[]
[]
[]
[]
[]
[]
[]
[]
[]
[]
[]
[]
[]
[]
[]
[]
[]
[]
[]
[]
[]
[]
[]
[]
[]
[{"$f":"D8628&\" \"&C8628","v":" "}]